{"text_format":"1","workbook":"xlsx","n_sheets":17,"sheets":["Start","Resultat","RS","Sorterat","Rapport","Vattenföring","Statistik","Diagram","Hist_data","Kommentarer","Kontakt","Länkar","Förklaring","Förklaring av parametrar","Problemhantering","Formler","Provpunkter"],"not_rendered":{"charts":24,"images":41,"macros":1,"external_links":0,"defined_names":5,"comments":7,"pivot_tables":0},"unopened":[],"bounds":{"document_bytes":16777216,"sheet_cells":100000,"rows_first":2000,"rows_last":500,"rows_between":2000,"halvings":0,"cell_chars":16384,"cell_head_chars":4096},"cells_cut":0,"cells_raw":0,"read":"whole","date_system":"1900"}

{"sheet":"Start","index":0,"n_rows":15,"n_cols":8,"rows_kept":15,"cut":false,"hidden":false,"merged":[]}
[]
[]
[null,null,null,null,"Saxån-Braån, vattenkontroll, kemi - 2021"]
[]
[]
[null,"Foto: Provpunkt 16, Saxån vid Saxtorp"]
[null,null,"Resultat sorterat per månad",null,"Resultat sorterat per provpunkt",null,null,"Diagram och statistik"]
[]
[]
[]
{"$rows_left_out":6}
{"sheet":"Resultat","index":1,"n_rows":138,"n_cols":17,"rows_kept":138,"cut":false,"hidden":false,"merged":[]}
[null,"Saxån-Braån 2021\nResultat"]
[null,null,null,"Peka på röda trianglar (►) för förklaring av parametrar"]
["Sorterings-","Provtagningspunkt","Provtagn"," Temp"," Syreh","Syrem","  pH","Gruml","Kond","PO4-P","Tot-P","Part.-P"," NO3+2-N","NH4-N"," Tot-N","Susp","Anmärkning"]
["ordning","Nr Läge","datum","  °C","mg/l","%",null,"  FNU","mS/m"," µg/l"," µg/l","µg/l","  µg/l","  µg/l","  µg/l","mg/l"]
[250,"januari"]
[1,"14 Svalövsbäcken uppstr Svalöv","2021-01-25",3,12.7,94,7.55,9.5,39.299999999999997,21,48,16,8900,28,8800,3.4,{"$f":"IF(Rapport!Q10=\"\",\"\",Rapport!Q10)","v":"Resultatet av kväve total, N, är mindre än summanav ammoniumkväve, NH4-N, och nitrat + nitritkväve, NO23-N. Skillnaden ligger dock inommätosäkerheten."}]
[2,"15:2 Svalövsbäcken nedstr Svalöv","2021-01-25",3.6,12.8,97,7.76,13,45.1,28,64,"",8700,290,8900,5.0999999999999996,{"$f":"IF(Rapport!Q11=\"\",\"\",Rapport!Q11)","v":""}]
[3,"3:2 Örstorpsbäcken","2021-01-25",4.2,11.9,91,7.9,9.1,69,57,210,60,16000,35,17000,6.3,{"$f":"IF(Rapport!Q12=\"\",\"\",Rapport!Q12)","v":""}]
[4,"5 Braån vid Asmundtorp","2021-01-25",3.3,12.6,94,7.92,14,49,42,81,30,8900,72,8900,7.2,{"$f":"IF(Rapport!Q13=\"\",\"\",Rapport!Q13)","v":""}]
[6,"26 Långgropen uppstr Eslöv","2021-01-25",3.3,11.3,85,7.53,14,45.6,45,86,31,7100,65,7400,5.7,{"$f":"IF(Rapport!Q14=\"\",\"\",Rapport!Q14)","v":""}]
{"$rows_left_out":129}
{"sheet":"RS","index":2,"n_rows":110,"n_cols":19,"rows_kept":110,"cut":false,"hidden":true,"merged":[]}
[{"$f":"TRIM(CONCATENATE(D1,E1))","v":"ProvtagningspunktProvtagn"},null,"Sorterings-","Provtagningspunkt","Provtagn"," Temp"," Syreh","Syrem","  pH","Gruml","Kond","PO4-P","Tot-P","Part.-P"," NO3+2-N","NH4-N"," Tot-N","Susp","Anmärkning"]
[null,null,"ordning","Nr Läge","datum","  °C","mg/l","%",null,"  FNU","mS/m"," µg/l"," µg/l","µg/l","  µg/l","  µg/l","  µg/l","mg/l"]
[{"$f":"TRIM(CONCATENATE(D3,E3))","v":"14 Svalövsbäcken uppstr Svalöv44221"},{"$f":"CONCATENATE(D3,MONTH(E3))","v":"14 Svalövsbäcken uppstr Svalöv1"},1,"14 Svalövsbäcken uppstr Svalöv","2021-01-25",3,12.7,94,7.55,9.5,39.299999999999997,21,48,16,8900,28,8800,3.4,"Resultatet av kväve total, N, är mindre än summanav ammoniumkväve, NH4-N, och nitrat + nitritkväve, NO23-N. Skillnaden ligger dock inommätosäkerheten."]
["14 Svalövsbäcken uppstr Svalöv44249","14 Svalövsbäcken uppstr Svalöv2",1,"14 Svalövsbäcken uppstr Svalöv","2021-02-22",2.8,12.2,90,7.46,12,36.5,25,75,43,6500,11,7200,4,""]
["14 Svalövsbäcken uppstr Svalöv44279","14 Svalövsbäcken uppstr Svalöv3",1,"14 Svalövsbäcken uppstr Svalöv","2021-03-24",5.5,12.6,100,7.96,4.0999999999999996,40.799999999999997,9.3000000000000007,22,9,5800,16,6700,2.2000000000000002,""]
["14 Svalövsbäcken uppstr Svalöv44313","14 Svalövsbäcken uppstr Svalöv4",1,"14 Svalövsbäcken uppstr Svalöv","2021-04-27",9.1,11.9,104,8.25,8,44.6,6.8,41,29,2200,39,3000,5.6,""]
["14 Svalövsbäcken uppstr Svalöv44341","14 Svalövsbäcken uppstr Svalöv5",1,"14 Svalövsbäcken uppstr Svalöv","2021-05-25",14.4,8.3000000000000007,82,8.09,8.1999999999999993,46.9,12,56,31,2100,70,2700,9.6999999999999993,""]
["14 Svalövsbäcken uppstr Svalöv44368","14 Svalövsbäcken uppstr Svalöv6",1,"14 Svalövsbäcken uppstr Svalöv","2021-06-21",21.2,3.3,37,7.7,6.4,51.1,56,130,50,640,41,1800,6.5,""]
["14 Svalövsbäcken uppstr Svalöv44398","14 Svalövsbäcken uppstr Svalöv7",1,"14 Svalövsbäcken uppstr Svalöv","2021-07-21",21.3,4.5,51,7.85,13.8,42.7,56,160,74,290,55,1700,11,""]
["14 Svalövsbäcken uppstr Svalöv44438","14 Svalövsbäcken uppstr Svalöv8",1,"14 Svalövsbäcken uppstr Svalöv","2021-08-30",16.8,11.3,117,8.5299999999999994,20,47.6,"","","","","","","","Analys missad för närsalter och susp"]
{"$rows_left_out":101}
{"sheet":"Sorterat","index":3,"n_rows":153,"n_cols":43,"rows_kept":153,"cut":false,"hidden":false,"merged":[[4,18,4,19]]}
[]
[null,"Saxån-Braån 2021"]
[null,"Sorterat per provpunkt"]
[null,null,null,"Värden < a räknas som a vid beräkning av statistik",null,null,null,null,null,null,null,null,null,null,null,null,null,null,null,null,null,null,null,null,null,null,null,null,null,null,"<-värden omvandlade till värden. Medelvärde hämtas här"]
["Sorterings-","Provtagningspunkt","Provtagn"," Temp"," Syreh","Syrem","  pH","Gruml","Kond","PO4-P","Tot-P","Part.-P"," NO3+2-N","NH4-N"," Tot-N","Susp","Anmärkning","provtagare/projektledare",null,null,null,null,null,null,null,null,null,null,null,null," Temp"," Syreh","Syrem","  pH","Gruml","BOD7","Susp","PO4-P","Tot-P"," NO3+2-N","NH4-N"," Tot-N","Susp"]
["ordning","Nr Läge","datum","  °C","mg/l","%",null,"  FNU","mS/m"," µg/l"," µg/l","µg/l","  µg/l","  µg/l","  µg/l","mg/l",null,null,null,null,null,null,null,null,null,null,null,null,null,null,"  °C","mg/l","%",null,"  FNU","mg/l","mg/l"," µg/l"," µg/l","  µg/l","  µg/l","  µg/l","mg/l"]
[1,"14 Svalövsbäcken uppstr Svalöv","2021-01-25",3,12.7,94,7.55,9.5,39.299999999999997,21,48,16,8900,28,8800,3.4,"Resultatet av kväve total, N, är mindre än summanav ammoniumkväve, NH4-N, och nitrat + nitritkväve, NO23-N. Skillnaden ligger dock inommätosäkerheten.",null,null,null,null,null,null,null,null,null,null,null,null,null,3,12.7,94,7.55,9.5,39.299999999999997,21,48,16,8900,28,8800,{"$f":"IF(OR(LEFT(P7,1)=\"<\",LEFT(P7,1)=\">\"),VALUE(MID(P7,2,5)),P7)","v":3.4}]
[1,"14 Svalövsbäcken uppstr Svalöv","2021-02-22",2.8,12.2,90,7.46,12,36.5,25,75,43,6500,11,7200,4,"",null,null,null,null,null,null,null,null,null,null,null,null,null,2.8,12.2,90,7.46,12,36.5,25,75,43,6500,11,7200,{"$f":"IF(OR(LEFT(P8,1)=\"<\",LEFT(P8,1)=\">\"),VALUE(MID(P8,2,5)),P8)","v":4}]
[1,"14 Svalövsbäcken uppstr Svalöv","2021-03-24",5.5,12.6,100,7.96,4.0999999999999996,40.799999999999997,9.3000000000000007,22,9,5800,16,6700,2.2000000000000002,"",null,null,null,null,null,null,null,null,null,null,null,null,null,5.5,12.6,100,7.96,4.0999999999999996,40.799999999999997,9.3000000000000007,22,9,5800,16,6700,2.2000000000000002]
[1,"14 Svalövsbäcken uppstr Svalöv","2021-04-27",9.1,11.9,104,8.25,8,44.6,6.8,41,29,2200,39,3000,5.6,"",null,null,null,null,null,null,null,null,null,null,null,null,null,9.1,11.9,104,8.25,8,44.6,6.8,41,29,2200,39,3000,5.6]
{"$rows_left_out":144}
{"sheet":"Rapport","index":4,"n_rows":142,"n_cols":17,"rows_kept":142,"cut":false,"hidden":false,"merged":[]}
[null,"Saxån-Braån 2021\nRapport"]
[null,"Metoder och mätosäkerhet"]
[null,"Saxån-Braån 2021"]
[null,"Vattenkontroll "]
[null," På uppdrag av Saxån-Braåns vattenvårdskommitté"]
[]
["Sorterings-","Provtagningspunkt","Provtagn"," Temp"," Syreh","Syrem","  pH","Gruml","Kond","PO4-P","Tot-P","Part.-P"," NO3+2-N","NH4-N"," Tot-N","Susp","Anmärkning"]
["ordning","Nr Läge","datum","  °C","mg/l","%",null,"  FNU","mS/m"," µg/l"," µg/l","µg/l","  µg/l","  µg/l","  µg/l","mg/l"]
[250,"januari"]
[1,"14 Svalövsbäcken uppstr Svalöv","2021-01-25",3,12.7,94,7.55,9.5,39.299999999999997,21,48,16,8900,28,8800,3.4,"Resultatet av kväve total, N, är mindre än summanav ammoniumkväve, NH4-N, och nitrat + nitritkväve, NO23-N. Skillnaden ligger dock inommätosäkerheten."]
{"$rows_left_out":133}
{"sheet":"Vattenföring","index":5,"n_rows":467,"n_cols":2,"rows_kept":467,"cut":false,"hidden":false,"merged":[]}
[]
["Saxån-Braån 2020"]
["Vattenföring "]
[]
[]
[]
[]
[]
[]
[]
{"$rows_left_out":458}
{"sheet":"Statistik","index":6,"n_rows":153,"n_cols":94,"rows_kept":153,"cut":false,"hidden":false,"merged":[]}
[null,"Saxån-Braån, Vattenkontroll - Statistik"]
[]
[null,{"$f":"CONCATENATE(\"Statistik för åren: \",MIN(R:R),\" - \",MAX(R:R))","v":"Statistik för åren: 2010 - 2020"}]
[null,"(kan vara annorlunda för vissa parametrar)"]
[]
[null,null,null,null,null,null,null,null,null,null,null,null,null,null,null,null,null,null,null,null,null,null,null,null,null,null,"Stödlinjer i diagram-->",null,null,null,null,null,null,null,null,null,null,null,null,null,null,null,null,null,null,null,null,null,null,null,null,null,null,null,null,null,null,null,null,null,null,null,null,null,null,null,null,null,null,null,null,null,null,null,null,null,null,null,null,null,null,"Värden omvandlade för statisitk -->"]
[null,null,null,"  °C","mg/l","%",null,"  FNU","mS/m"," µg/l"," µg/l"," µg/l","  µg/l","  µg/l","  µg/l","mg/l",null,null,null,null,null,null,null,null,null,null,"Syre",null,null,null,"pH",null,null,null,"Turb",null,null,null,"Kond",null,null,"PO4-P",null,null,"Tot_P",null,null,null,"Part-P",null,null,"NO2,3-N",null,null,"NH4-N",null,null,"Tot-N",null,null,null,"Susp",null,null,null,null,null,null,null,null,null,null,null,null,null,null,null,null,null,null,null,"  °C","mg/l","%",null,"  FNU","mS/m"," µg/l"," µg/l"," µg/l","  µg/l","  µg/l","  µg/l","mg/l"]
[null,{"$f":"INDEX(Provpunkter!B1:B10,Provpunkter!G1)","v":"15:2 Svalövsbäcken nedstr Svalöv"},"Datum"," Temp"," Syreh","Syrem","  pH","Gruml","Kond","PO4-P","Tot-P","Part.-P"," NO3+2-N","NH4-N"," Tot-N","Susp",null,"År","Månad",null,null,null,null,null,null,null,"Medel","+/- 1 std","- 1 std","Klass 4","Medel","+/- 1 std","- 1 std","Klass 3","Medel","+/- 1 std","- 1 std","Klass 5","Medel","+/- 1 std","- 1 std","Medel","+/- 1 std","- 1 std","Medel","+/- 1 std","- 1 std","Klass 5","Medel","+/- 1 std","- 1 std","Medel","+/- 1 std","- 1 std","Medel","+/- 1 std","- 1 std","Medel","+/- 1 std","- 1 std","Klass 5","Medel","+/- 1 std","- 1 std",null,null,"Test datum ",null,null,null,null,null,null,null,null,null,null,null,null,null,null," Temp"," Syrehalt","Syrem","  pH","Gruml","BOD7","Susp","PO4-P","Tot-P"," NO3+2-N","NH4-N"," Tot-N","Susp"]
[{"$f":"IF(B9=B$8,1,\"\")","v":""},null,null,null,null,null,null,null,null,null,null,null,null,null,null,null,null,null,null,null,null,null,null,null,null,null,{"$f":"$E$145","v":10.541590909090909},{"$f":"AA9+E$146","v":13.086650433746245},{"$f":"AA9-E$146","v":7.9965313844355723},2.95,{"$f":"$G$145","v":7.8355303030303025},{"$f":"AE9+G$146","v":8.0354704253415363},{"$f":"AE9-G$146","v":7.6355901807190687},6.5,{"$f":"$H$145","v":13.161742424242423},{"$f":"AI9+H$146","v":43.810002340134545},{"$f":"AI9-H$146","v":-17.4865174916497},7,{"$f":"$I$145","v":52.671969696969711},{"$f":"AM9+I$146","v":62.81683313153323},{"$f":"AM9-I$146","v":42.527106262406193},{"$f":"$J$145","v":53.603816793893131},{"$f":"AP9+J$146","v":125.17443861875186},{"$f":"AP9-J$146","v":-17.966805030965602},{"$f":"$K$145","v":95.717557251908403},{"$f":"AS9+$K$146","v":195.19505952555048},{"$f":"AS9-$K$146","v":-3.759945021733671},100,{"$f":"$L$145","v":23},{"$f":"AW9+$L$146","v":34.313708498984759},{"$f":"AW9-$L$146","v":11.686291501015239},{"$f":"$M$145","v":5893.5877862595416},{"$f":"AZ9+$M$146","v":8596.4199386799191},{"$f":"AZ9-$M$146","v":3190.7556338391637},{"$f":"$N$145","v":432.76335877862596},{"$f":"BC9+$N$146","v":1842.4404130773487},{"$f":"BC9-$N$146","v":-976.91369552009689},{"$f":"$O$145","v":6806.1068702290077},{"$f":"BF9+$O$146","v":9445.3595536514258},{"$f":"BF9-$O$146","v":4166.8541868065895},5000,{"$f":"$P$145","v":10.090076335877868},{"$f":"BJ9+$P$146","v":29.113660302029061},{"$f":"BJ9-$P$146","v":-8.9335076302733256},null,null,{"$f":"C9","v":0},null,null,null,null,null,null,null,null,null,null,null,null,null,null,{"$f":"IF(D9=\"\",\"\",IF(OR(LEFT(D9,1)=\"<\",LEFT(D9,1)=\">\"),VALUE(MID(D9,2,3)),D9))","v":""},{"$f":"IF(E9=\"\",\"\",IF(OR(LEFT(E9,1)=\"<\",LEFT(E9,1)=\">\"),VALUE(MID(E9,2,3)),E9))","v":""},{"$f":"IF(F9=\"\",\"\",IF(OR(LEFT(F9,1)=\"<\",LEFT(F9,1)=\">\"),VALUE(MID(F9,2,3)),F9))","v":""},{"$f":"IF(G9=\"\",\"\",IF(OR(LEFT(G9,1)=\"<\",LEFT(G9,1)=\">\"),VALUE(MID(G9,2,3)),G9))","v":""},{"$f":"IF(H9=\"\",\"\",IF(OR(LEFT(H9,1)=\"<\",LEFT(H9,1)=\">\"),VALUE(MID(H9,2,3)),H9))","v":""},{"$f":"IF(I9=\"\",\"\",IF(OR(LEFT(I9,1)=\"<\",LEFT(I9,1)=\">\"),VALUE(MID(I9,2,3)),I9))","v":""},{"$f":"IF(J9=\"\",\"\",IF(OR(LEFT(J9,1)=\"<\",LEFT(J9,1)=\">\"),VALUE(MID(J9,2,3)),J9))","v":""},{"$f":"IF(K9=\"\",\"\",IF(OR(LEFT(K9,1)=\"<\",LEFT(K9,1)=\">\"),VALUE(MID(K9,2,3)),K9))","v":""},{"$f":"IF(L9=\"\",\"\",IF(OR(LEFT(L9,1)=\"<\",LEFT(L9,1)=\">\"),VALUE(MID(L9,2,3)),L9))","v":""},{"$f":"IF(M9=\"\",\"\",IF(OR(LEFT(M9,1)=\"<\",LEFT(M9,1)=\">\"),VALUE(MID(M9,2,3)),M9))","v":""},{"$f":"IF(N9=\"\",\"\",IF(OR(LEFT(N9,1)=\"<\",LEFT(N9,1)=\">\"),VALUE(MID(N9,2,3)),N9))","v":""},{"$f":"IF(O9=\"\",\"\",IF(OR(LEFT(O9,1)=\"<\",LEFT(O9,1)=\">\"),VALUE(MID(O9,2,3)),O9))","v":""},{"$f":"IF(P9=\"\",\"\",IF(OR(LEFT(P9,1)=\"<\",LEFT(P9,1)=\">\"),VALUE(MID(P9,2,3)),P9))","v":""}]
[null,"15:2 Svalövsbäcken nedstr Svalöv","2010-01-26",-0.1,15.7,106.93145418055717,7.86,9.1999999999999993,62,40,51,null,4500,980,6200,"<5","fruset",2010,1,null,null,null,null,null,null,null,{"$f":"$E$145","v":10.541590909090909},{"$f":"AA10+E$146","v":13.086650433746245},{"$f":"AA10-E$146","v":7.9965313844355723},2.95,{"$f":"$G$145","v":7.8355303030303025},{"$f":"AE10+G$146","v":8.0354704253415363},{"$f":"AE10-G$146","v":7.6355901807190687},6.5,{"$f":"$H$145","v":13.161742424242423},{"$f":"AI10+H$146","v":43.810002340134545},{"$f":"AI10-H$146","v":-17.4865174916497},7,{"$f":"$I$145","v":52.671969696969711},{"$f":"AM10+I$146","v":62.81683313153323},{"$f":"AM10-I$146","v":42.527106262406193},{"$f":"$J$145","v":53.603816793893131},{"$f":"AP10+J$146","v":125.17443861875186},{"$f":"AP10-J$146","v":-17.966805030965602},{"$f":"$K$145","v":95.717557251908403},{"$f":"AS10+$K$146","v":195.19505952555048},{"$f":"AS10-$K$146","v":-3.759945021733671},100,{"$f":"$L$145","v":23},{"$f":"AW10+$L$146","v":34.313708498984759},{"$f":"AW10-$L$146","v":11.686291501015239},{"$f":"$M$145","v":5893.5877862595416},{"$f":"AZ10+$M$146","v":8596.4199386799191},{"$f":"AZ10-$M$146","v":3190.7556338391637},{"$f":"$N$145","v":432.76335877862596},{"$f":"BC10+$N$146","v":1842.4404130773487},{"$f":"BC10-$N$146","v":-976.91369552009689},{"$f":"$O$145","v":6806.1068702290077},{"$f":"BF10+$O$146","v":9445.3595536514258},{"$f":"BF10-$O$146","v":4166.8541868065895},5000,{"$f":"$P$145","v":10.090076335877868},{"$f":"BJ10+$P$146","v":29.113660302029061},{"$f":"BJ10-$P$146","v":-8.9335076302733256},null,null,{"$f":"C10","v":40204},null,null,null,null,null,null,null,null,null,null,null,null,null,null,{"$f":"IF(D10=\"\",\"\",IF(OR(LEFT(D10,1)=\"<\",LEFT(D10,1)=\">\"),VALUE(MID(D10,2,3)),D10))","v":-0.1},{"$f":"IF(E10=\"\",\"\",IF(OR(LEFT(E10,1)=\"<\",LEFT(E10,1)=\">\"),VALUE(MID(E10,2,3)),E10))","v":15.7},{"$f":"IF(F10=\"\",\"\",IF(OR(LEFT(F10,1)=\"<\",LEFT(F10,1)=\">\"),VALUE(MID(F10,2,3)),F10))","v":106.93145418055717},{"$f":"IF(G10=\"\",\"\",IF(OR(LEFT(G10,1)=\"<\",LEFT(G10,1)=\">\"),VALUE(MID(G10,2,3)),G10))","v":7.86},{"$f":"IF(H10=\"\",\"\",IF(OR(LEFT(H10,1)=\"<\",LEFT(H10,1)=\">\"),VALUE(MID(H10,2,3)),H10))","v":9.1999999999999993},{"$f":"IF(I10=\"\",\"\",IF(OR(LEFT(I10,1)=\"<\",LEFT(I10,1)=\">\"),VALUE(MID(I10,2,3)),I10))","v":62},{"$f":"IF(J10=\"\",\"\",IF(OR(LEFT(J10,1)=\"<\",LEFT(J10,1)=\">\"),VALUE(MID(J10,2,3)),J10))","v":40},{"$f":"IF(K10=\"\",\"\",IF(OR(LEFT(K10,1)=\"<\",LEFT(K10,1)=\">\"),VALUE(MID(K10,2,3)),K10))","v":51},{"$f":"IF(L10=\"\",\"\",IF(OR(LEFT(L10,1)=\"<\",LEFT(L10,1)=\">\"),VALUE(MID(L10,2,3)),L10))","v":""},{"$f":"IF(M10=\"\",\"\",IF(OR(LEFT(M10,1)=\"<\",LEFT(M10,1)=\">\"),VALUE(MID(M10,2,3)),M10))","v":4500},{"$f":"IF(N10=\"\",\"\",IF(OR(LEFT(N10,1)=\"<\",LEFT(N10,1)=\">\"),VALUE(MID(N10,2,3)),N10))","v":980},{"$f":"IF(O10=\"\",\"\",IF(OR(LEFT(O10,1)=\"<\",LEFT(O10,1)=\">\"),VALUE(MID(O10,2,3)),O10))","v":6200},{"$f":"IF(P10=\"\",\"\",IF(OR(LEFT(P10,1)=\"<\",LEFT(P10,1)=\">\"),VALUE(MID(P10,2,3)),P10))","v":5}]
{"$rows_left_out":144}
{"sheet":"Diagram","index":7,"n_rows":200,"n_cols":45,"rows_kept":200,"cut":false,"hidden":false,"merged":[]}
[]
[]
[null,null,"Provpunkt:",null,null,null,null,null,null,null,null,null,null,null,null,null,null,"Senaste provtagningsdatum",null,null,null,null,null,null,null,null,null,null,null,null,null,null,null,null,null,null,null,null,null,null,null,null,null,"Senaste provtagningsdatum"]
[null,null,{"$f":"Statistik!$B8","v":"15:2 Svalövsbäcken nedstr Svalöv"},null,null,null,null,"Statistik för:",{"$f":"MIN(Statistik!$C9:$C144)","v":"2010-01-26"},"-",{"$f":"MAX(Statistik!$C9:$C144)","v":"2020-12-21"},null,null,null,null,null,null,{"$f":"IF((VLOOKUP(C4,Provpunkter!B1:C10,2,FALSE))=12,MAX(RS!E3:E13),MAX(RS!E51:E56))","v":"2021-11-24"},null,null,null,null,null,null,null,null,null,null,null,null,null,null,null,null,null,null,null,null,null,null,null,null,null,"2021-06-21"]
[]
[]
[null,null,null,null,null,null,null,null,null,null,null,null,"Syre","halt",null,"mättnad",null,"Årets resultat",null,null,null,null,null,null,null,null,null,null,null,null,null,null,null,null,null,null,null,null,null,null,null,null,null,"Årets resultat"]
[null,null,null,null,null,null,null,null,null,null,null,null,null,"mg/l",null,"%",null,"Datum","mg/l","%",null,null,null,null,null,null,null,null,null,null,null,null,null,null,null,null,null,null,null,null,null,null,null,"Datum","mg/l"]
[null,null,null,null,null,null,null,null,null,null,null,null,"Medel",{"$f":"Statistik!E$145","v":10.541590909090909},null,{"$f":"Statistik!F$145","v":90.513127588097348},null,{"$f":"IFERROR(VLOOKUP(CONCATENATE($C$4,\"1\"),RS!$B$3:$S$110,4,FALSE),\"\")","v":"2021-01-25"},{"$f":"IFERROR(VLOOKUP(CONCATENATE($C$4,\"1\"),RS!$B$3:$S$110,6,FALSE),\"\")","v":12.8},{"$f":"IFERROR(VLOOKUP(CONCATENATE($C$4,\"1\"),RS!$B$3:$S$110,7,FALSE),\"\")","v":97},null,null,null,null,null,null,null,null,null,null,null,null,null,null,null,null,null,null,null,null,null,null,null,"2021-01-25",12.8]
[null,null,null,null,null,null,null,null,null,null,null,null,"Std.avv.",{"$f":"Statistik!E$146","v":2.5450595246553362},null,{"$f":"Statistik!F$146","v":17.644127533022875},null,{"$f":"IFERROR(VLOOKUP(CONCATENATE($C$4,\"2\"),RS!$B$3:$S$110,4,FALSE),\"\")","v":"2021-02-22"},{"$f":"IFERROR(VLOOKUP(CONCATENATE($C$4,\"2\"),RS!$B$3:$S$110,6,FALSE),\"\")","v":12.9},{"$f":"IFERROR(VLOOKUP(CONCATENATE($C$4,\"2\"),RS!$B$3:$S$110,7,FALSE),\"\")","v":96},null,null,null,null,null,null,null,null,null,null,null,null,null,null,null,null,null,null,null,null,null,null,null,"2021-02-22",12.9]
{"$rows_left_out":191}
{"sheet":"Hist_data","index":8,"n_rows":1194,"n_cols":19,"rows_kept":1194,"cut":false,"hidden":true,"merged":[]}
[null,null,"sista rad",1086,"OBS! Om det blir fler än 2000 rader måste makro ändras"]
[null,"Saxån-Braån"]
[null,"Vattenkontroll - historiska data"]
[null,null,null,"  °C","mg/l","%",null,"  FNU","mg/l","mg/l"," µg/l"," µg/l","  µg/l","  µg/l",null,"  µg/l"]
["Sorterings-","Provtagningspunkt","Datum"," Temp"," Syreh","Syrem","  pH","Gruml","Kond","PO4-P","Tot-P","Part.-P"," NO3+2-N","NH4-N"," Tot-N","Susp","Anmärkning","år","månad"]
[null,"Denna rad ska vara tom"]
[1,"14 Svalövsbäcken uppstr Svalöv","2010-01-26",0,15.2,103.82513661202184,7.92,8.6,47.7,27,31,20,3100,90,3800,"<5",null,{"$f":"YEAR(C7)","v":2010},{"$f":"MONTH(C7)","v":1}]
[1,"14 Svalövsbäcken uppstr Svalöv","2010-02-22",1,13.4,94.184448019320072,7.93,7.7,49.7,32,38,12,2500,130,2900,"<5",null,2010,2]
[1,"14 Svalövsbäcken uppstr Svalöv","2010-03-24",2.2000000000000002,12.6,91.59331135981617,7.49,13,28.3,37,61,30,5300,49,6400,6.1,null,2010,3]
[1,"14 Svalövsbäcken uppstr Svalöv","2010-04-27",10,7.6,67.556419026876398,8.1999999999999993,6.8,38.799999999999997,5,26,19,1800,11,2500,5.9,null,2010,4]
{"$rows_left_out":1185}
{"sheet":"Kommentarer","index":9,"n_rows":132,"n_cols":4,"rows_kept":132,"cut":false,"hidden":false,"merged":[]}
[]
[null,"Saxån-Braån 2021"]
[null,"Vattenkontroll - Kommentarer till resultat"]
[]
[null," "]
[null,null,null,"Så här skriver du ut!"]
[null,null,null,"Klicka på aktuell månad till vänster\nObservera att sidbrytningar kan bli olika beroende på skrivare och skrivarinställningar"]
[]
[]
[]
{"$rows_left_out":123}
{"sheet":"Kontakt","index":10,"n_rows":18,"n_cols":4,"rows_kept":18,"cut":false,"hidden":false,"merged":[[20,3,21,3],[22,3,23,3]]}
[null,"Saxån-Braån"]
[null,"Vattenkontroll - kontaktpersoner"]
[]
[null,"Konsult:",null,"Uppdragsgivare:"]
[null,"Ekologigruppen",null,"Saxån-Braåns vattenvårdskommitté"]
[null,"Stora Södergatan 8C",null,"Miljöförvaltningen"]
[null,"222 23 Lund",null,"Landskrona kommun"]
[null,null,null,"261 80 Landskrona"]
[null,"Telefon: 046-106750 (växel)",null,"Telefon: 0418-470 599"]
[null,null,null,"Telefax: 0418-470 603"]
{"$rows_left_out":9}
{"sheet":"Länkar","index":11,"n_rows":19,"n_cols":5,"rows_kept":19,"cut":false,"hidden":false,"merged":[]}
[]
[null,"Saxån-Braån"]
[null,"Vattenkontroll - länkar till äldre resultat mm"]
[null,"Länkar till nationell databas, SLU (Sveriges LantbruksUniversitet). "]
[null,"Välj data från en eller flera stationer. Välj från stationskarta eller tabell."]
[null,"Internetuppkoppling krävs för denna funktion."]
[]
[null,"Vattendrag                 SLU                 t o m 2012",null,"SLU, MVM                 fr o m 2013*","  * Välj i Undersökningar, t ex: \"SRK Saxån\" "]
[]
[]
{"$rows_left_out":10}
{"sheet":"Förklaring","index":12,"n_rows":48,"n_cols":8,"rows_kept":48,"cut":false,"hidden":false,"merged":[]}
[]
[null,"Saxån-Braån"]
[null,"Vattenkontroll - förklaring till färgmarkeringar"]
[]
[null,"Indelning av halter och värden baseras på:"]
[null,"Bedömningsgrunder för miljökvalitet - Sjöar och Vattendrag "]
[null,"Naturvårdsverket 1999 (Rapport 4913)"]
[]
[null,"Observera att bedömningsgrunderna rymmer fem klasser:"]
[]
{"$rows_left_out":39}
{"sheet":"Förklaring av parametrar","index":13,"n_rows":0,"n_cols":0,"rows_kept":0,"cut":false,"hidden":false,"merged":[]}

{"sheet":"Problemhantering","index":14,"n_rows":10,"n_cols":5,"rows_kept":10,"cut":false,"hidden":true,"merged":[]}
["Problemhantering"]
[]
["OBS! Makrohanteraren är skyddad, för att få fram makron gäller lösenordet \"kontroll\""]
["Info om versionsuppdateringar, liksom makrofunktioner m m finns i en separat fil:",null,null,null,"Arsfil_Versionshistorik_och_makron.xlsx"]
[]
[]
["Om ni stöter på problem i just denna fil eller har förslag till förbättringar, skriv in nedan"]
[]
["Datum","Version","Problembeskrivning / uppdatering","Sign"]
["2021-08-19","1.6","Ny flik  \"Problemhantering\". Flikarna \"Verionshistorik\" och \"Makron m m\" flyttas till separat fil, gemensam för alla årsfiler. ","BW"]
{"$rows_left_out":1}
{"sheet":"Formler","index":15,"n_rows":41,"n_cols":42,"rows_kept":41,"cut":false,"hidden":true,"merged":[]}
["Detta blad används endast av Ekologgruppens personal. Bladet är skrivskyddat."]
["Formler för alkalinitet och syremättnad"]
["Kopiera cellerna i kolumn F-H på rad 5 till de rader i bladet Resultat där syremättnad och alkalinitet ska beräknas"]
["Sorterings-","Provtagningspunkt","Provtagn"," Vattenf"," Temp"," Syreh","Syrem","  pH","Gruml","  Kond","BOD7","PO4-P","Tot-P","Part.-P"," NO3+2-N","NH4-N"," Tot-N","Susp","Anmärkning","provtagare/projektledare"]
[null,null,null,null,null,null,{"$f":"ROUND((F5/((9.266*EXP(-0.04555*E5)+5.374))*100),0)","v":0},null,null,null,null,null,null,null,null,null,null,null,null,null,null,null,null,null,null,null,null,null,null,null,null,null,null,null,null,null,null,null,null,null,null,0.02]
[]
[]
[]
[]
[]
{"$rows_left_out":32}
{"sheet":"Provpunkter","index":16,"n_rows":10,"n_cols":7,"rows_kept":10,"cut":false,"hidden":true,"merged":[]}
[1,"14 Svalövsbäcken uppstr Svalöv",12,null,null,null,2]
[2,"15:2 Svalövsbäcken nedstr Svalöv",12]
[3,"3:2 Örstorpsbäcken",12]
[4,"5 Braån vid Asmundtorp",12]
[5,"28:2 Bäck N Trolleholm",6]
[6,"26 Långgropen uppstr Eslöv",12]
[7,"24 Långgropen nedstr Eslöv",12]
[8,"19 Saxån vid Annelöv",6]
[9,"30 Välabäcken",12]
[10,"16 Saxån vid Saxtorp",12]