{"text_format":"1","workbook":"xlsx","n_sheets":17,"sheets":["Start","Resultat","RS","Sorterat","Rapport","Vattenföring","Statistik","Diagram","Hist_data","Kommentarer","Kontakt","Länkar","Förklaring","Förklaring av parametrar","Problemhantering","Formler","Provpunkter"],"not_rendered":{"charts":24,"images":41,"macros":1,"external_links":0,"defined_names":5,"comments":7,"pivot_tables":0},"unopened":[],"bounds":{"document_bytes":16777216,"sheet_cells":100000,"rows_first":2000,"rows_last":500,"rows_between":2000,"halvings":0,"cell_chars":16384,"cell_head_chars":4096},"cells_cut":0,"cells_raw":0,"read":"whole","date_system":"1900"}

{"sheet":"Start","index":0,"n_rows":15,"n_cols":8,"rows_kept":15,"cut":false,"hidden":false,"merged":[]}
[]
[]
[null,null,null,null,"Saxån-Braån, vattenkontroll, kemi - 2021"]
[]
[]
[null,"Foto: Provpunkt 16, Saxån vid Saxtorp"]
[null,null,"Resultat sorterat per månad",null,"Resultat sorterat per provpunkt",null,null,"Diagram och statistik"]
[]
[]
[]
[null,null,"Månadsrapport",null,"Kommentarer",null,null,"Vattenföring"]
[]
[null,null,"Länkar",null,"Kontakt",null,null,"Användarguide"]
[]
[null,null,"På uppdrag av Saxån-Braåns vattenvårdskommitté"]

{"sheet":"Resultat","index":1,"n_rows":138,"n_cols":17,"rows_kept":138,"cut":false,"hidden":false,"merged":[]}
[null,"Saxån-Braån 2021\nResultat"]
[null,null,null,"Peka på röda trianglar (►) för förklaring av parametrar"]
["Sorterings-","Provtagningspunkt","Provtagn"," Temp"," Syreh","Syrem","  pH","Gruml","Kond","PO4-P","Tot-P","Part.-P"," NO3+2-N","NH4-N"," Tot-N","Susp","Anmärkning"]
["ordning","Nr Läge","datum","  °C","mg/l","%",null,"  FNU","mS/m"," µg/l"," µg/l","µg/l","  µg/l","  µg/l","  µg/l","mg/l"]
[250,"januari"]
[1,"14 Svalövsbäcken uppstr Svalöv","2021-01-25",3,12.7,94,7.55,9.5,39.299999999999997,21,48,16,8900,28,8800,3.4,{"$f":"IF(Rapport!Q10=\"\",\"\",Rapport!Q10)","v":"Resultatet av kväve total, N, är mindre än summanav ammoniumkväve, NH4-N, och nitrat + nitritkväve, NO23-N. Skillnaden ligger dock inommätosäkerheten."}]
[2,"15:2 Svalövsbäcken nedstr Svalöv","2021-01-25",3.6,12.8,97,7.76,13,45.1,28,64,"",8700,290,8900,5.0999999999999996,{"$f":"IF(Rapport!Q11=\"\",\"\",Rapport!Q11)","v":""}]
[3,"3:2 Örstorpsbäcken","2021-01-25",4.2,11.9,91,7.9,9.1,69,57,210,60,16000,35,17000,6.3,{"$f":"IF(Rapport!Q12=\"\",\"\",Rapport!Q12)","v":""}]
[4,"5 Braån vid Asmundtorp","2021-01-25",3.3,12.6,94,7.92,14,49,42,81,30,8900,72,8900,7.2,{"$f":"IF(Rapport!Q13=\"\",\"\",Rapport!Q13)","v":""}]
[6,"26 Långgropen uppstr Eslöv","2021-01-25",3.3,11.3,85,7.53,14,45.6,45,86,31,7100,65,7400,5.7,{"$f":"IF(Rapport!Q14=\"\",\"\",Rapport!Q14)","v":""}]
[7,"24 Långgropen nedstr Eslöv","2021-01-25",3.6,11.7,88,7.59,14,47.2,46,84,"",6900,71,7200,5.8,{"$f":"IF(Rapport!Q15=\"\",\"\",Rapport!Q15)","v":""}]
[9,"30 Välabäcken","2021-01-25",4.0999999999999996,11.7,90,7.81,4.9000000000000004,76.099999999999994,40,89,26,15000,"<10",15000,4.2,{"$f":"IF(Rapport!Q16=\"\",\"\",Rapport!Q16)","v":""}]
[10,"16 Saxån vid Saxtorp","2021-01-25",3.3,12.8,96,7.99,15,54.7,36,100,37,9200,"<10",9200,9.3000000000000007,{"$f":"IF(Rapport!Q17=\"\",\"\",Rapport!Q17)","v":""}]
[200]
[250,"februari"]
[1,"14 Svalövsbäcken uppstr Svalöv","2021-02-22",2.8,12.2,90,7.46,12,36.5,25,75,43,6500,11,7200,4,{"$f":"IF(Rapport!Q20=\"\",\"\",Rapport!Q20)","v":""}]
[2,"15:2 Svalövsbäcken nedstr Svalöv","2021-02-22",3.2,12.9,96,7.69,14,39.9,32,81,"",6600,160,7500,6.8,{"$f":"IF(Rapport!Q21=\"\",\"\",Rapport!Q21)","v":""}]
[3,"3:2 Örstorpsbäcken","2021-02-22",3.6,12.4,94,7.85,11,58.5,70,110,36,13000,"<10",13000,4.4000000000000004,{"$f":"IF(Rapport!Q22=\"\",\"\",Rapport!Q22)","v":""}]
[4,"5 Braån vid Asmundtorp","2021-02-22",3.3,12.9,97,7.91,19,41.4,60,110,46,7400,64,7900,9.6,{"$f":"IF(Rapport!Q23=\"\",\"\",Rapport!Q23)","v":""}]
[5,"28:2 Bäck N Trolleholm","2021-02-22",1.6,13.3,95,7.75,5.3,36.6,5,22,"",2300,52,2500,3,"Is låg kvar i bäcken, vattnet rann ovan is."]
[6,"26 Långgropen uppstr Eslöv","2021-02-22",2.9,12.5,93,7.64,16,40.700000000000003,55,98,36,6300,73,7000,3.9,{"$f":"IF(Rapport!Q25=\"\",\"\",Rapport!Q25)","v":""}]
[7,"24 Långgropen nedstr Eslöv","2021-02-22",2.6,12.4,91,7.69,15,42.7,56,99,"",6000,83,6800,6.4,{"$f":"IF(Rapport!Q26=\"\",\"\",Rapport!Q26)","v":""}]
[8,"19 Saxån vid Annelöv","2021-02-22",3.2,13.2,99,7.97,17,44.7,65,110,"",6000,41,6300,15,{"$f":"IF(Rapport!Q27=\"\",\"\",Rapport!Q27)","v":""}]
[9,"30 Välabäcken","2021-02-22",3.2,12.7,95,7.86,13,59.4,74,110,36,10000,15,11000,10,{"$f":"IF(Rapport!Q28=\"\",\"\",Rapport!Q28)","v":""}]
[10,"16 Saxån vid Saxtorp","2021-02-22",3.1,12.8,95,7.96,19,44.9,80,130,49,6700,69,7100,13,{"$f":"IF(Rapport!Q29=\"\",\"\",Rapport!Q29)","v":""}]
[200]
[250,"mars"]
[1,"14 Svalövsbäcken uppstr Svalöv","2021-03-24",5.5,12.6,100,7.96,4.0999999999999996,40.799999999999997,9.3000000000000007,22,9,5800,16,6700,2.2000000000000002,{"$f":"IF(Rapport!Q32=\"\",\"\",Rapport!Q32)","v":""}]
[2,"15:2 Svalövsbäcken nedstr Svalöv","2021-03-24",6.5,12.8,104,8.0399999999999991,4.0999999999999996,48.8,16,32,"",6200,610,7400,3,{"$f":"IF(Rapport!Q33=\"\",\"\",Rapport!Q33)","v":""}]
[3,"3:2 Örstorpsbäcken","2021-03-24",5.6,13.1,104,8.11,2.6,72.8,59,75,13,13000,10,15000,"<2",{"$f":"IF(Rapport!Q34=\"\",\"\",Rapport!Q34)","v":""}]
[4,"5 Braån vid Asmundtorp","2021-03-24",5.7,12.8,102,8.15,3.8,54.3,21,41,14,6800,48,7600,2.8,{"$f":"IF(Rapport!Q35=\"\",\"\",Rapport!Q35)","v":""}]
[5,"28:2 Bäck N Trolleholm","2021-03-24",6.7,11.8,97,8.1,2.5,44.6,4.0999999999999996,10,"",1500,11,2200,2.2999999999999998,{"$f":"IF(Rapport!Q36=\"\",\"\",Rapport!Q36)","v":""}]
[6,"26 Långgropen uppstr Eslöv","2021-03-24",6.4,13.9,113,8.08,4.5,57.4,15,36,19,6100,18,7000,2.6,{"$f":"IF(Rapport!Q37=\"\",\"\",Rapport!Q37)","v":""}]
[7,"24 Långgropen nedstr Eslöv","2021-03-24",6.1,13.4,108,8.0299999999999994,4.2,60.1,17,35,"",6000,47,6500,2.8,{"$f":"IF(Rapport!Q38=\"\",\"\",Rapport!Q38)","v":""}]
[8,"19 Saxån vid Annelöv","2021-03-24",5.9,12.4,100,8.2100000000000009,5.6,60,23,39,"",5900,16,6700,4.8,{"$f":"IF(Rapport!Q39=\"\",\"\",Rapport!Q39)","v":""}]
[9,"30 Välabäcken","2021-03-24",6.4,13.9,113,8.23,1.6,76.400000000000006,14,37,20,12000,"<10",13000,"<2",{"$f":"IF(Rapport!Q40=\"\",\"\",Rapport!Q40)","v":""}]
[10,"16 Saxån vid Saxtorp","2021-03-24",5.7,12.4,99,8.19,4.5999999999999996,65,29,48,17,7800,22,9000,3.2,{"$f":"IF(Rapport!Q41=\"\",\"\",Rapport!Q41)","v":""}]
[200]
[250,"april"]
[1,"14 Svalövsbäcken uppstr Svalöv","2021-04-27",9.1,11.9,104,8.25,8,44.6,6.8,41,29,2200,39,3000,5.6,{"$f":"IF(Rapport!Q44=\"\",\"\",Rapport!Q44)","v":""}]
[2,"15:2 Svalövsbäcken nedstr Svalöv","2021-04-27",6.6,14.8,121,8.1,3.7,54.2,7.8,27,"",3700,600,4900,"<2",{"$f":"IF(Rapport!Q45=\"\",\"\",Rapport!Q45)","v":""}]
[3,"3:2 Örstorpsbäcken","2021-04-27",5.5,11.4,91,8,3.8,70.900000000000006,88,120,31,6400,26,7300,3.3,{"$f":"IF(Rapport!Q46=\"\",\"\",Rapport!Q46)","v":""}]
[4,"5 Braån vid Asmundtorp","2021-04-27",6.2,10.9,88,8.0299999999999994,2,57.7,14,30,10,3900,26,4600,"<2",{"$f":"IF(Rapport!Q47=\"\",\"\",Rapport!Q47)","v":""}]
[6,"26 Långgropen uppstr Eslöv","2021-04-27",6.1,17.100000000000001,138,8.26,1.8,60.3,2.7,18,12,3700,"<10",4300,"<2",{"$f":"IF(Rapport!Q48=\"\",\"\",Rapport!Q48)","v":""}]
[7,"24 Långgropen nedstr Eslöv","2021-04-27",6.1,13.4,108,8,2.7,61.5,9,26,"",2900,52,3500,"<2",{"$f":"IF(Rapport!Q49=\"\",\"\",Rapport!Q49)","v":""}]
[9,"30 Välabäcken","2021-04-27",5.6,13.1,104,7.99,1.6,79.099999999999994,4.4000000000000004,46,19,7200,69,8200,"<2",{"$f":"IF(Rapport!Q50=\"\",\"\",Rapport!Q50)","v":""}]
[10,"16 Saxån vid Saxtorp","2021-04-27",7.6,11.6,97,8.02,2.4,64.599999999999994,24,43,16,4000,30,4800,"<2",{"$f":"IF(Rapport!Q51=\"\",\"\",Rapport!Q51)","v":""}]
[200]
[250,"maj"]
[1,"14 Svalövsbäcken uppstr Svalöv","2021-05-25",14.4,8.3000000000000007,82,8.09,8.1999999999999993,46.9,12,56,31,2100,70,2700,9.6999999999999993,{"$f":"IF(Rapport!Q54=\"\",\"\",Rapport!Q54)","v":""}]
[2,"15:2 Svalövsbäcken nedstr Svalöv","2021-05-25",12.4,9.6,90,8,1.8,56.4,14,39,"",4000,67,4400,"<2",{"$f":"IF(Rapport!Q55=\"\",\"\",Rapport!Q55)","v":""}]
[3,"3:2 Örstorpsbäcken","2021-05-25",11.6,8.5,78,8.02,2,72.099999999999994,110,140,20,6300,57,6600,2.4,{"$f":"IF(Rapport!Q56=\"\",\"\",Rapport!Q56)","v":""}]
[4,"5 Braån vid Asmundtorp","2021-05-25",11.8,8.4,78,8.06,2.1,59.8,45,66,11,4100,47,4500,2.4,{"$f":"IF(Rapport!Q57=\"\",\"\",Rapport!Q57)","v":""}]
[5,"28:2 Bäck N Trolleholm","2021-05-25",11.2,9.8000000000000007,90,8.1999999999999993,1.6,52.1,5,11,"",460,13,740,2.1,{"$f":"IF(Rapport!Q58=\"\",\"\",Rapport!Q58)","v":""}]
[6,"26 Långgropen uppstr Eslöv","2021-05-25",12.6,9.9,93,8.02,1.8,62.5,11,33,17,2700,39,3200,2.4,{"$f":"IF(Rapport!Q59=\"\",\"\",Rapport!Q59)","v":""}]
[7,"24 Långgropen nedstr Eslöv","2021-05-25",12.4,8.9,84,7.9,1.9,62.5,17,39,"",2400,75,2900,2,{"$f":"IF(Rapport!Q60=\"\",\"\",Rapport!Q60)","v":""}]
[8,"19 Saxån vid Annelöv","2021-05-25",12.9,8.1999999999999993,78,8.14,2,61.5,39,63,"",2700,60,3000,"<2",{"$f":"IF(Rapport!Q61=\"\",\"\",Rapport!Q61)","v":""}]
[9,"30 Välabäcken","2021-05-25",11.6,10.7,99,8.1300000000000008,1.2,77.3,63,110,22,5100,46,5500,"<2",{"$f":"IF(Rapport!Q62=\"\",\"\",Rapport!Q62)","v":""}]
[10,"16 Saxån vid Saxtorp","2021-05-25",12.5,8.9,84,8.16,1.9,66,55,77,15,3700,63,4000,"<2",{"$f":"IF(Rapport!Q63=\"\",\"\",Rapport!Q63)","v":""}]
[200]
[250,"juni"]
[1,"14 Svalövsbäcken uppstr Svalöv","2021-06-21",21.2,3.3,37,7.7,6.4,51.1,56,130,50,640,41,1800,6.5,{"$f":"IF(Rapport!Q66=\"\",\"\",Rapport!Q66)","v":""}]
[2,"15:2 Svalövsbäcken nedstr Svalöv","2021-06-21",16.5,6.8,70,7.65,1.2,69.099999999999994,72,110,"",9500,110,10000,"<2",{"$f":"IF(Rapport!Q67=\"\",\"\",Rapport!Q67)","v":""}]
[3,"3:2 Örstorpsbäcken","2021-06-21",16.5,7,72,7.91,2.8,73.5,280,280,40,3800,64,4700,2.2000000000000002,{"$f":"IF(Rapport!Q68=\"\",\"\",Rapport!Q68)","v":""}]
[4,"5 Braån vid Asmundtorp","2021-06-21",18.399999999999999,6.7,71,7.97,2.9,67.8,170,180,20,2900,51,3700,3,{"$f":"IF(Rapport!Q69=\"\",\"\",Rapport!Q69)","v":""}]
[6,"26 Långgropen uppstr Eslöv","2021-06-21",16.3,5.9,60,7.73,2,66.400000000000006,68,94,29,1200,26,1800,"<2",{"$f":"IF(Rapport!Q70=\"\",\"\",Rapport!Q70)","v":""}]
[7,"24 Långgropen nedstr Eslöv","2021-06-21",16.3,5.7,58,7.72,2.6,70.8,70,100,"",1100,52,1600,"<2",{"$f":"IF(Rapport!Q71=\"\",\"\",Rapport!Q71)","v":""}]
[9,"30 Välabäcken","2021-06-21",15,7.2,72,7.84,1.2,79.400000000000006,140,210,60,4200,130,5300,7.8,{"$f":"IF(Rapport!Q72=\"\",\"\",Rapport!Q72)","v":""}]
[10,"16 Saxån vid Saxtorp","2021-06-21",18.8,6.1,66,7.92,1.2,70.5,170,190,20,2900,70,3600,"<2",{"$f":"IF(Rapport!Q73=\"\",\"\",Rapport!Q73)","v":""}]
[200]
[250,"juli"]
[1,"14 Svalövsbäcken uppstr Svalöv","2021-07-21",21.3,4.5,51,7.85,13.8,42.7,56,160,74,290,55,1700,11,{"$f":"IF(Rapport!Q76=\"\",\"\",Rapport!Q76)","v":""}]
[2,"15:2 Svalövsbäcken nedstr Svalöv","2021-07-21",17.399999999999999,7.7,80,7.74,4.8,66.400000000000006,72,98,"",7200,110,7800,3.3,{"$f":"IF(Rapport!Q77=\"\",\"\",Rapport!Q77)","v":""}]
[3,"3:2 Örstorpsbäcken","2021-07-21",15.9,8.3000000000000007,84,7.94,5.6,72.8,280,300,30,5200,35,5800,5.0999999999999996,{"$f":"IF(Rapport!Q78=\"\",\"\",Rapport!Q78)","v":""}]
[4,"5 Braån vid Asmundtorp","2021-07-21",17.3,7.6,79,7.99,4.3,59.8,160,180,10,1900,27,2300,3.2,{"$f":"IF(Rapport!Q79=\"\",\"\",Rapport!Q79)","v":""}]
[6,"26 Långgropen uppstr Eslöv","2021-07-21",16.100000000000001,7.3,74,7.7,1.9,62.4,77,90,16,1200,30,1800,"<2",{"$f":"IF(Rapport!Q80=\"\",\"\",Rapport!Q80)","v":""}]
[7,"24 Långgropen nedstr Eslöv","2021-07-21",16,6.6,67,7.67,2.5,65.2,78,92,"",1100,49,1500,2.5,{"$f":"IF(Rapport!Q81=\"\",\"\",Rapport!Q81)","v":""}]
[9,"30 Välabäcken","2021-07-21",15.4,7.4,74,7.84,1.2,79.3,230,310,60,3000,140,4000,11,{"$f":"IF(Rapport!Q82=\"\",\"\",Rapport!Q82)","v":""}]
[10,"16 Saxån vid Saxtorp","2021-07-21",18.2,7.2,76,7.96,1.8,62.4,170,200,10,2000,34,2700,"<2",{"$f":"IF(Rapport!Q83=\"\",\"\",Rapport!Q83)","v":""}]
[200]
[250,"augusti"]
[1,"14 Svalövsbäcken uppstr Svalöv","2021-08-30",16.8,11.3,117,8.5299999999999994,20,47.6,"","","","","","","",{"$f":"IF(Rapport!Q86=\"\",\"\",Rapport!Q86)","v":"Analys missad för närsalter och susp"}]
[2,"15:2 Svalövsbäcken nedstr Svalöv","2021-08-30",16.2,9.6,98,8.02,7.1,55.8,"","","","","","","",{"$f":"IF(Rapport!Q87=\"\",\"\",Rapport!Q87)","v":"Analys missad för närsalter och susp"}]
[3,"3:2 Örstorpsbäcken","2021-08-30",15.3,11.6,116,8,11,71.8,"","","","","","","",{"$f":"IF(Rapport!Q88=\"\",\"\",Rapport!Q88)","v":"Analys missad för närsalter och susp"}]
[4,"5 Braån vid Asmundtorp","2021-08-30",16.399999999999999,11.7,120,8.08,4.5999999999999996,52.4,"","","","","","","",{"$f":"IF(Rapport!Q89=\"\",\"\",Rapport!Q89)","v":"Analys missad för närsalter och susp"}]
[5,"28:2 Bäck N Trolleholm","2021-08-30",14.6,10.9,108,8.1300000000000008,5.3,50.2,"","","","","","","",{"$f":"IF(Rapport!Q90=\"\",\"\",Rapport!Q90)","v":"Analys missad för närsalter och susp"}]
[6,"26 Långgropen uppstr Eslöv","2021-08-30",14.6,8.5,84,7.87,6.5,53.8,"","","","","","","",{"$f":"IF(Rapport!Q91=\"\",\"\",Rapport!Q91)","v":"Analys missad för närsalter och susp"}]
[7,"24 Långgropen nedstr Eslöv","2021-08-30",14.7,8.1,80,7.83,7.3,53.5,"","","","","","","",{"$f":"IF(Rapport!Q92=\"\",\"\",Rapport!Q92)","v":"Analys missad för närsalter och susp"}]
[8,"19 Saxån vid Annelöv","2021-08-30",15.9,9.9,100,7.96,2.5,41,"","","","","","","",{"$f":"IF(Rapport!Q93=\"\",\"\",Rapport!Q93)","v":"Analys missad för närsalter och susp"}]
[9,"30 Välabäcken","2021-08-30",15.2,9.6999999999999993,97,7.89,1.1000000000000001,74.400000000000006,"","","","","","","",{"$f":"IF(Rapport!Q94=\"\",\"\",Rapport!Q94)","v":"Analys missad för närsalter och susp"}]
[10,"16 Saxån vid Saxtorp","2021-08-30",16,11.3,115,8.1199999999999992,3.6,61.2,"","","","","","","",{"$f":"IF(Rapport!Q95=\"\",\"\",Rapport!Q95)","v":"Analys missad för närsalter och susp"}]
[200]
[250,"september"]
[1,"14 Svalövsbäcken uppstr Svalöv","2021-09-29",14.3,10.5,103,7.98,15,52.4,4.8,85,61,2200,41,2900,14,{"$f":"IF(Rapport!Q98=\"\",\"\",Rapport!Q98)","v":""}]
[2,"15:2 Svalövsbäcken nedstr Svalöv","2021-09-29",13.5,10.3,99,7.97,13,55.9,33,110,"",4000,110,4500,12,{"$f":"IF(Rapport!Q99=\"\",\"\",Rapport!Q99)","v":""}]
[3,"3:2 Örstorpsbäcken","2021-09-29",13.4,11,106,7.94,7.1,73.099999999999994,130,150,20,12000,24,11000,3.1,{"$f":"IF(Rapport!Q100=\"\",\"\",Rapport!Q100)","v":""}]
[4,"5 Braån vid Asmundtorp","2021-09-29",13.9,10.6,103,7.97,21,47.5,230,280,60,5300,53,5600,11,{"$f":"IF(Rapport!Q101=\"\",\"\",Rapport!Q101)","v":""}]
[6,"26 Långgropen uppstr Eslöv","2021-09-29",12.8,8.4,80,7.8,8,58.5,100,140,20,5900,18,6000,3.6,{"$f":"IF(Rapport!Q102=\"\",\"\",Rapport!Q102)","v":""}]
[7,"24 Långgropen nedstr Eslöv","2021-09-29",12.8,8.6,82,7.77,6.5,55.4,99,130,"",4400,26,4800,3.1,{"$f":"IF(Rapport!Q103=\"\",\"\",Rapport!Q103)","v":""}]
[9,"30 Välabäcken","2021-09-29",12.2,9.6,90,7.8,1.8,76.2,130,140,10,4200,19,4600,"<2",{"$f":"IF(Rapport!Q104=\"\",\"\",Rapport!Q104)","v":""}]
[10,"16 Saxån vid Saxtorp","2021-09-29",13.7,9.3000000000000007,90,7.88,5.0999999999999996,66.7,110,130,20,3600,16,3800,2.8,{"$f":"IF(Rapport!Q105=\"\",\"\",Rapport!Q105)","v":""}]
[200]
[250,"oktober"]
[1,"14 Svalövsbäcken uppstr Svalöv","2021-10-20",11.2,9.5,87,7.67,10,51.4,17,57,32,6900,41,8200,12,{"$f":"IF(Rapport!Q108=\"\",\"\",Rapport!Q108)","v":""}]
[2,"15:2 Svalövsbäcken nedstr Svalöv","2021-10-20",12.1,9.3000000000000007,87,7.75,55,52.4,30,220,"",7200,"<10",8700,86,{"$f":"IF(Rapport!Q109=\"\",\"\",Rapport!Q109)","v":""}]
[3,"3:2 Örstorpsbäcken","2021-10-20",12.4,8.6,81,7.83,78,67.400000000000006,140,250,100,12000,16,14000,22,{"$f":"IF(Rapport!Q110=\"\",\"\",Rapport!Q110)","v":""}]
[4,"5 Braån vid Asmundtorp","2021-10-20",12.1,9.3000000000000007,87,7.98,22,57.7,180,230,40,7500,15,8700,18,{"$f":"IF(Rapport!Q111=\"\",\"\",Rapport!Q111)","v":""}]
[5,"28:2 Bäck N Trolleholm","2021-10-20",12.4,9.4,88,7.91,22,43.9,6.4,67,"",1600,"<10",2500,24,{"$f":"IF(Rapport!Q112=\"\",\"\",Rapport!Q112)","v":""}]
[6,"26 Långgropen uppstr Eslöv","2021-10-20",12.3,8,75,7.79,40,55.2,65,140,68,6700,"<10",7900,20,{"$f":"IF(Rapport!Q113=\"\",\"\",Rapport!Q113)","v":""}]
[7,"24 Långgropen nedstr Eslöv","2021-10-20",12.5,8,75,7.79,13,46.5,46,86,"",4300,77,5100,9.3000000000000007,{"$f":"IF(Rapport!Q114=\"\",\"\",Rapport!Q114)","v":""}]
[8,"19 Saxån vid Annelöv","2021-10-20",11.5,8.8000000000000007,81,7.96,2.6,64.099999999999994,56,73,"",4900,"<10",6000,3.4,{"$f":"IF(Rapport!Q115=\"\",\"\",Rapport!Q115)","v":""}]
[9,"30 Välabäcken","2021-10-20",12.6,8.3000000000000007,78,7.9,2.2999999999999998,81.3,71,87,11,8800,15,9900,3,{"$f":"IF(Rapport!Q116=\"\",\"\",Rapport!Q116)","v":""}]
[10,"16 Saxån vid Saxtorp","2021-10-20",12.1,9.3000000000000007,87,8.02,4.5,67.900000000000006,69,95,21,6100,"<10",7100,3.8,{"$f":"IF(Rapport!Q117=\"\",\"\",Rapport!Q117)","v":""}]
[200,null,null,null,null,null,null,null,null,null,null,null,null,null,null,null,{"$f":"IF(Rapport!Q118=\"\",\"\",Rapport!Q118)","v":""}]
[250,"november"]
[1,"14 Svalövsbäcken uppstr Svalöv","2021-11-24",6.7,10.5,86,8.39,4.5999999999999996,51.2,23,37,11,6200,53,6300,4.5,{"$f":"IF(Rapport!Q120=\"\",\"\",Rapport!Q120)","v":""}]
[2,"15:2 Svalövsbäcken nedstr Svalöv","2021-11-24",7.7,11.5,97,8.0399999999999991,3.9,57.4,45,60,"",6600,350,7100,3.7,{"$f":"IF(Rapport!Q121=\"\",\"\",Rapport!Q121)","v":""}]
[3,"3:2 Örstorpsbäcken","2021-11-24",8.1999999999999993,10.1,86,8.0399999999999991,2.7,79.099999999999994,120,110,10,13000,20,13000,2.2000000000000002,{"$f":"IF(Rapport!Q122=\"\",\"\",Rapport!Q122)","v":""}]
[4,"5 Braån vid Asmundtorp","2021-11-24",7.4,10.6,88,8.18,4.2,61.4,84,86,8,8200,14,8200,2.7,{"$f":"IF(Rapport!Q123=\"\",\"\",Rapport!Q123)","v":""}]
[6,"26 Långgropen uppstr Eslöv","2021-11-24",7.6,9.6999999999999993,81,7.94,2.8,61.8,33,40,11,7800,23,8100,2.6,{"$f":"IF(Rapport!Q124=\"\",\"\",Rapport!Q124)","v":""}]
[7,"24 Långgropen nedstr Eslöv","2021-11-24",7.5,9.6999999999999993,81,7.92,2.8,62.5,34,39,"",7400,37,7600,"<2",{"$f":"IF(Rapport!Q125=\"\",\"\",Rapport!Q125)","v":""}]
[9,"30 Välabäcken","2021-11-24",8.4,10,86,8.11,1,83.7,70,74,5,12000,34,12000,"<2",{"$f":"IF(Rapport!Q126=\"\",\"\",Rapport!Q126)","v":""}]
[10,"16 Saxån vid Saxtorp","2021-11-24",7.1,10.8,89,8.23,3.5,67.5,59,64,11,8200,25,8600,2.7,{"$f":"IF(Rapport!Q127=\"\",\"\",Rapport!Q127)","v":""}]
[200,null,null,null,null,null,null,null,null,null,null,null,null,null,null,null,{"$f":"IF(Rapport!Q128=\"\",\"\",Rapport!Q128)","v":""}]
[250,"december"]
[1,"14 Svalövsbäcken uppstr Svalöv","2021-12-21",2.2000000000000002,12.5,91,7.7,5.0999999999999996,41.5,14,26,5,7100,42,7000,3.4,{"$f":"IF(Rapport!Q130=\"\",\"\",Rapport!Q130)","v":""}]
[2,"15:2 Svalövsbäcken nedstr Svalöv","2021-12-21",2.5,12.8,94,7.8,5.4,47.8,23,36,"",7300,400,7200,3.5,{"$f":"IF(Rapport!Q131=\"\",\"\",Rapport!Q131)","v":""}]
[3,"3:2 Örstorpsbäcken","2021-12-21",3.4,11.9,89,7.82,6.2,74.7,76,100,19,14000,48,13000,6.2,{"$f":"IF(Rapport!Q132=\"\",\"\",Rapport!Q132)","v":""}]
[4,"5 Braån vid Asmundtorp","2021-12-21",2.8,12.6,93,8.01,6.6,52.5,60,87,14,7700,110,7200,5.7,{"$f":"IF(Rapport!Q133=\"\",\"\",Rapport!Q133)","v":""}]
[5,"28:2 Bäck N Trolleholm","2021-12-21",0.3,13.7,94,7.97,2.8,38.200000000000003,3,12,"",1400,27,1700,"<2",{"$f":"IF(Rapport!Q134=\"\",\"\",Rapport!Q134)","v":""}]
[6,"26 Långgropen uppstr Eslöv","2021-12-21",2.5,11.4,84,7.7,6.6,53.7,24,39,8,6300,83,6300,4.5999999999999996,{"$f":"IF(Rapport!Q135=\"\",\"\",Rapport!Q135)","v":""}]
[7,"24 Långgropen nedstr Eslöv","2021-12-21",2.2000000000000002,11.6,84,7.73,6.8,55.4,25,49,"",5900,130,5600,5.5,{"$f":"IF(Rapport!Q136=\"\",\"\",Rapport!Q136)","v":""}]
[8,"19 Saxån vid Annelöv","2021-12-21",2.6,12.8,94,8,7.8,56.3,39,65,"",6100,75,5900,7.3,{"$f":"IF(Rapport!Q137=\"\",\"\",Rapport!Q137)","v":""}]
[9,"30 Välabäcken","2021-12-21",3.5,12.1,91,7.94,3.1,78.7,45,49,"<5,0",14000,60,13000,"<2",{"$f":"IF(Rapport!Q138=\"\",\"\",Rapport!Q138)","v":""}]
[10,"16 Saxån vid Saxtorp","2021-12-21",2.7,12.4,91,8.07,6.6,61.9,45,350,300,8200,73,7600,6.2,{"$f":"IF(Rapport!Q139=\"\",\"\",Rapport!Q139)","v":""}]
[200]
[null,""]
[null,""]

{"sheet":"RS","index":2,"n_rows":110,"n_cols":19,"rows_kept":110,"cut":false,"hidden":true,"merged":[]}
[{"$f":"TRIM(CONCATENATE(D1,E1))","v":"ProvtagningspunktProvtagn"},null,"Sorterings-","Provtagningspunkt","Provtagn"," Temp"," Syreh","Syrem","  pH","Gruml","Kond","PO4-P","Tot-P","Part.-P"," NO3+2-N","NH4-N"," Tot-N","Susp","Anmärkning"]
[null,null,"ordning","Nr Läge","datum","  °C","mg/l","%",null,"  FNU","mS/m"," µg/l"," µg/l","µg/l","  µg/l","  µg/l","  µg/l","mg/l"]
[{"$f":"TRIM(CONCATENATE(D3,E3))","v":"14 Svalövsbäcken uppstr Svalöv44221"},{"$f":"CONCATENATE(D3,MONTH(E3))","v":"14 Svalövsbäcken uppstr Svalöv1"},1,"14 Svalövsbäcken uppstr Svalöv","2021-01-25",3,12.7,94,7.55,9.5,39.299999999999997,21,48,16,8900,28,8800,3.4,"Resultatet av kväve total, N, är mindre än summanav ammoniumkväve, NH4-N, och nitrat + nitritkväve, NO23-N. Skillnaden ligger dock inommätosäkerheten."]
["14 Svalövsbäcken uppstr Svalöv44249","14 Svalövsbäcken uppstr Svalöv2",1,"14 Svalövsbäcken uppstr Svalöv","2021-02-22",2.8,12.2,90,7.46,12,36.5,25,75,43,6500,11,7200,4,""]
["14 Svalövsbäcken uppstr Svalöv44279","14 Svalövsbäcken uppstr Svalöv3",1,"14 Svalövsbäcken uppstr Svalöv","2021-03-24",5.5,12.6,100,7.96,4.0999999999999996,40.799999999999997,9.3000000000000007,22,9,5800,16,6700,2.2000000000000002,""]
["14 Svalövsbäcken uppstr Svalöv44313","14 Svalövsbäcken uppstr Svalöv4",1,"14 Svalövsbäcken uppstr Svalöv","2021-04-27",9.1,11.9,104,8.25,8,44.6,6.8,41,29,2200,39,3000,5.6,""]
["14 Svalövsbäcken uppstr Svalöv44341","14 Svalövsbäcken uppstr Svalöv5",1,"14 Svalövsbäcken uppstr Svalöv","2021-05-25",14.4,8.3000000000000007,82,8.09,8.1999999999999993,46.9,12,56,31,2100,70,2700,9.6999999999999993,""]
["14 Svalövsbäcken uppstr Svalöv44368","14 Svalövsbäcken uppstr Svalöv6",1,"14 Svalövsbäcken uppstr Svalöv","2021-06-21",21.2,3.3,37,7.7,6.4,51.1,56,130,50,640,41,1800,6.5,""]
["14 Svalövsbäcken uppstr Svalöv44398","14 Svalövsbäcken uppstr Svalöv7",1,"14 Svalövsbäcken uppstr Svalöv","2021-07-21",21.3,4.5,51,7.85,13.8,42.7,56,160,74,290,55,1700,11,""]
["14 Svalövsbäcken uppstr Svalöv44438","14 Svalövsbäcken uppstr Svalöv8",1,"14 Svalövsbäcken uppstr Svalöv","2021-08-30",16.8,11.3,117,8.5299999999999994,20,47.6,"","","","","","","","Analys missad för närsalter och susp"]
["14 Svalövsbäcken uppstr Svalöv44468","14 Svalövsbäcken uppstr Svalöv9",1,"14 Svalövsbäcken uppstr Svalöv","2021-09-29",14.3,10.5,103,7.98,15,52.4,4.8,85,61,2200,41,2900,14,""]
["14 Svalövsbäcken uppstr Svalöv44489","14 Svalövsbäcken uppstr Svalöv10",1,"14 Svalövsbäcken uppstr Svalöv","2021-10-20",11.2,9.5,87,7.67,10,51.4,17,57,32,6900,41,8200,12,""]
["14 Svalövsbäcken uppstr Svalöv44524",{"$f":"CONCATENATE(D13,MONTH(E13))","v":"14 Svalövsbäcken uppstr Svalöv11"},1,"14 Svalövsbäcken uppstr Svalöv","2021-11-24",6.7,10.5,86,8.39,4.5999999999999996,51.2,23,37,11,6200,53,6300,4.5,""]
["14 Svalövsbäcken uppstr Svalöv2021-12-21","14 Svalövsbäcken uppstr Svalöv12",1,"14 Svalövsbäcken uppstr Svalöv","2021-12-21",2.2000000000000002,12.5,91,7.7,5.0999999999999996,41.5,14,26,5,7100,42,7000,3.4,""]
["15:2 Svalövsbäcken nedstr Svalöv44221","15:2 Svalövsbäcken nedstr Svalöv1",2,"15:2 Svalövsbäcken nedstr Svalöv","2021-01-25",3.6,12.8,97,7.76,13,45.1,28,64,"",8700,290,8900,5.0999999999999996,""]
["15:2 Svalövsbäcken nedstr Svalöv44249","15:2 Svalövsbäcken nedstr Svalöv2",2,"15:2 Svalövsbäcken nedstr Svalöv","2021-02-22",3.2,12.9,96,7.69,14,39.9,32,81,"",6600,160,7500,6.8,""]
["15:2 Svalövsbäcken nedstr Svalöv44279","15:2 Svalövsbäcken nedstr Svalöv3",2,"15:2 Svalövsbäcken nedstr Svalöv","2021-03-24",6.5,12.8,104,8.0399999999999991,4.0999999999999996,48.8,16,32,"",6200,610,7400,3,""]
["15:2 Svalövsbäcken nedstr Svalöv44313","15:2 Svalövsbäcken nedstr Svalöv4",2,"15:2 Svalövsbäcken nedstr Svalöv","2021-04-27",6.6,14.8,121,8.1,3.7,54.2,7.8,27,"",3700,600,4900,"<2",""]
["15:2 Svalövsbäcken nedstr Svalöv44341","15:2 Svalövsbäcken nedstr Svalöv5",2,"15:2 Svalövsbäcken nedstr Svalöv","2021-05-25",12.4,9.6,90,8,1.8,56.4,14,39,"",4000,67,4400,"<2",""]
["15:2 Svalövsbäcken nedstr Svalöv44368","15:2 Svalövsbäcken nedstr Svalöv6",2,"15:2 Svalövsbäcken nedstr Svalöv","2021-06-21",16.5,6.8,70,7.65,1.2,69.099999999999994,72,110,"",9500,110,10000,"<2",""]
["15:2 Svalövsbäcken nedstr Svalöv44398","15:2 Svalövsbäcken nedstr Svalöv7",2,"15:2 Svalövsbäcken nedstr Svalöv","2021-07-21",17.399999999999999,7.7,80,7.74,4.8,66.400000000000006,72,98,"",7200,110,7800,3.3,""]
["15:2 Svalövsbäcken nedstr Svalöv44438","15:2 Svalövsbäcken nedstr Svalöv8",2,"15:2 Svalövsbäcken nedstr Svalöv","2021-08-30",16.2,9.6,98,8.02,7.1,55.8,"","","","","","","","Analys missad för närsalter och susp"]
["15:2 Svalövsbäcken nedstr Svalöv44468","15:2 Svalövsbäcken nedstr Svalöv9",2,"15:2 Svalövsbäcken nedstr Svalöv","2021-09-29",13.5,10.3,99,7.97,13,55.9,33,110,"",4000,110,4500,12,""]
["15:2 Svalövsbäcken nedstr Svalöv44489","15:2 Svalövsbäcken nedstr Svalöv10",2,"15:2 Svalövsbäcken nedstr Svalöv","2021-10-20",12.1,9.3000000000000007,87,7.75,55,52.4,30,220,"",7200,"<10",8700,86,""]
["15:2 Svalövsbäcken nedstr Svalöv44524","15:2 Svalövsbäcken nedstr Svalöv11",2,"15:2 Svalövsbäcken nedstr Svalöv","2021-11-24",7.7,11.5,97,8.0399999999999991,3.9,57.4,45,60,"",6600,350,7100,3.7,""]
["15:2 Svalövsbäcken nedstr Svalöv2021-12-21","15:2 Svalövsbäcken nedstr Svalöv12",2,"15:2 Svalövsbäcken nedstr Svalöv","2021-12-21",2.5,12.8,94,7.8,5.4,47.8,23,36,"",7300,400,7200,3.5,""]
["3:2 Örstorpsbäcken44221","3:2 Örstorpsbäcken1",3,"3:2 Örstorpsbäcken","2021-01-25",4.2,11.9,91,7.9,9.1,69,57,210,60,16000,35,17000,6.3,""]
["3:2 Örstorpsbäcken44249","3:2 Örstorpsbäcken2",3,"3:2 Örstorpsbäcken","2021-02-22",3.6,12.4,94,7.85,11,58.5,70,110,36,13000,"<10",13000,4.4000000000000004,""]
["3:2 Örstorpsbäcken44279","3:2 Örstorpsbäcken3",3,"3:2 Örstorpsbäcken","2021-03-24",5.6,13.1,104,8.11,2.6,72.8,59,75,13,13000,10,15000,"<2",""]
["3:2 Örstorpsbäcken44313","3:2 Örstorpsbäcken4",3,"3:2 Örstorpsbäcken","2021-04-27",5.5,11.4,91,8,3.8,70.900000000000006,88,120,31,6400,26,7300,3.3,""]
["3:2 Örstorpsbäcken44341","3:2 Örstorpsbäcken5",3,"3:2 Örstorpsbäcken","2021-05-25",11.6,8.5,78,8.02,2,72.099999999999994,110,140,20,6300,57,6600,2.4,""]
["3:2 Örstorpsbäcken44368","3:2 Örstorpsbäcken6",3,"3:2 Örstorpsbäcken","2021-06-21",16.5,7,72,7.91,2.8,73.5,280,280,40,3800,64,4700,2.2000000000000002,""]
["3:2 Örstorpsbäcken44398","3:2 Örstorpsbäcken7",3,"3:2 Örstorpsbäcken","2021-07-21",15.9,8.3000000000000007,84,7.94,5.6,72.8,280,300,30,5200,35,5800,5.0999999999999996,""]
["3:2 Örstorpsbäcken44438","3:2 Örstorpsbäcken8",3,"3:2 Örstorpsbäcken","2021-08-30",15.3,11.6,116,8,11,71.8,"","","","","","","","Analys missad för närsalter och susp"]
[{"$f":"TRIM(CONCATENATE(D35,E35))","v":"3:2 Örstorpsbäcken44468"},"3:2 Örstorpsbäcken9",3,"3:2 Örstorpsbäcken","2021-09-29",13.4,11,106,7.94,7.1,73.099999999999994,130,150,20,12000,24,11000,3.1,""]
["3:2 Örstorpsbäcken44489","3:2 Örstorpsbäcken10",3,"3:2 Örstorpsbäcken","2021-10-20",12.4,8.6,81,7.83,78,67.400000000000006,140,250,100,12000,16,14000,22,""]
["3:2 Örstorpsbäcken44524","3:2 Örstorpsbäcken11",3,"3:2 Örstorpsbäcken","2021-11-24",8.1999999999999993,10.1,86,8.0399999999999991,2.7,79.099999999999994,120,110,10,13000,20,13000,2.2000000000000002,""]
["3:2 Örstorpsbäcken2021-12-21","3:2 Örstorpsbäcken12",3,"3:2 Örstorpsbäcken","2021-12-21",3.4,11.9,89,7.82,6.2,74.7,76,100,19,14000,48,13000,6.2,""]
["5 Braån vid Asmundtorp44221","5 Braån vid Asmundtorp1",4,"5 Braån vid Asmundtorp","2021-01-25",3.3,12.6,94,7.92,14,49,42,81,30,8900,72,8900,7.2,""]
["5 Braån vid Asmundtorp44249","5 Braån vid Asmundtorp2",4,"5 Braån vid Asmundtorp","2021-02-22",3.3,12.9,97,7.91,19,41.4,60,110,46,7400,64,7900,9.6,""]
["5 Braån vid Asmundtorp44279","5 Braån vid Asmundtorp3",4,"5 Braån vid Asmundtorp","2021-03-24",5.7,12.8,102,8.15,3.8,54.3,21,41,14,6800,48,7600,2.8,""]
["5 Braån vid Asmundtorp44313","5 Braån vid Asmundtorp4",4,"5 Braån vid Asmundtorp","2021-04-27",6.2,10.9,88,8.0299999999999994,2,57.7,14,30,10,3900,26,4600,"<2",""]
["5 Braån vid Asmundtorp44341","5 Braån vid Asmundtorp5",4,"5 Braån vid Asmundtorp","2021-05-25",11.8,8.4,78,8.06,2.1,59.8,45,66,11,4100,47,4500,2.4,""]
["5 Braån vid Asmundtorp44368","5 Braån vid Asmundtorp6",4,"5 Braån vid Asmundtorp","2021-06-21",18.399999999999999,6.7,71,7.97,2.9,67.8,170,180,20,2900,51,3700,3,""]
["5 Braån vid Asmundtorp44398","5 Braån vid Asmundtorp7",4,"5 Braån vid Asmundtorp","2021-07-21",17.3,7.6,79,7.99,4.3,59.8,160,180,10,1900,27,2300,3.2,""]
["5 Braån vid Asmundtorp44438","5 Braån vid Asmundtorp8",4,"5 Braån vid Asmundtorp","2021-08-30",16.399999999999999,11.7,120,8.08,4.5999999999999996,52.4,"","","","","","","","Analys missad för närsalter och susp"]
["5 Braån vid Asmundtorp44468","5 Braån vid Asmundtorp9",4,"5 Braån vid Asmundtorp","2021-09-29",13.9,10.6,103,7.97,21,47.5,230,280,60,5300,53,5600,11,""]
["5 Braån vid Asmundtorp44489","5 Braån vid Asmundtorp10",4,"5 Braån vid Asmundtorp","2021-10-20",12.1,9.3000000000000007,87,7.98,22,57.7,180,230,40,7500,15,8700,18,""]
["5 Braån vid Asmundtorp44524","5 Braån vid Asmundtorp11",4,"5 Braån vid Asmundtorp","2021-11-24",7.4,10.6,88,8.18,4.2,61.4,84,86,8,8200,14,8200,2.7,""]
["5 Braån vid Asmundtorp2021-12-21","5 Braån vid Asmundtorp12",4,"5 Braån vid Asmundtorp","2021-12-21",2.8,12.6,93,8.01,6.6,52.5,60,87,14,7700,110,7200,5.7,""]
["28:2 Bäck N Trolleholm44249","28:2 Bäck N Trolleholm2",5,"28:2 Bäck N Trolleholm","2021-02-22",1.6,13.3,95,7.75,5.3,36.6,5,22,"",2300,52,2500,3,"Is låg kvar i bäcken, vattnet rann ovan is."]
["28:2 Bäck N Trolleholm44279","28:2 Bäck N Trolleholm3",5,"28:2 Bäck N Trolleholm","2021-03-24",6.7,11.8,97,8.1,2.5,44.6,4.0999999999999996,10,"",1500,11,2200,2.2999999999999998,""]
["28:2 Bäck N Trolleholm44341","28:2 Bäck N Trolleholm5",5,"28:2 Bäck N Trolleholm","2021-05-25",11.2,9.8000000000000007,90,8.1999999999999993,1.6,52.1,5,11,"",460,13,740,2.1,""]
["28:2 Bäck N Trolleholm44438","28:2 Bäck N Trolleholm8",5,"28:2 Bäck N Trolleholm","2021-08-30",14.6,10.9,108,8.1300000000000008,5.3,50.2,"","","","","","","","Analys missad för närsalter och susp"]
["28:2 Bäck N Trolleholm44489","28:2 Bäck N Trolleholm10",5,"28:2 Bäck N Trolleholm","2021-10-20",12.4,9.4,88,7.91,22,43.9,6.4,67,"",1600,"<10",2500,24,""]
["28:2 Bäck N Trolleholm2021-12-21","28:2 Bäck N Trolleholm12",5,"28:2 Bäck N Trolleholm","2021-12-21",0.3,13.7,94,7.97,2.8,38.200000000000003,3,12,"",1400,27,1700,"<2",""]
["26 Långgropen uppstr Eslöv44221","26 Långgropen uppstr Eslöv1",6,"26 Långgropen uppstr Eslöv","2021-01-25",3.3,11.3,85,7.53,14,45.6,45,86,31,7100,65,7400,5.7,""]
["26 Långgropen uppstr Eslöv44249","26 Långgropen uppstr Eslöv2",6,"26 Långgropen uppstr Eslöv","2021-02-22",2.9,12.5,93,7.64,16,40.700000000000003,55,98,36,6300,73,7000,3.9,""]
["26 Långgropen uppstr Eslöv44279","26 Långgropen uppstr Eslöv3",6,"26 Långgropen uppstr Eslöv","2021-03-24",6.4,13.9,113,8.08,4.5,57.4,15,36,19,6100,18,7000,2.6,""]
["26 Långgropen uppstr Eslöv44313","26 Långgropen uppstr Eslöv4",6,"26 Långgropen uppstr Eslöv","2021-04-27",6.1,17.100000000000001,138,8.26,1.8,60.3,2.7,18,12,3700,"<10",4300,"<2",""]
["26 Långgropen uppstr Eslöv44341","26 Långgropen uppstr Eslöv5",6,"26 Långgropen uppstr Eslöv","2021-05-25",12.6,9.9,93,8.02,1.8,62.5,11,33,17,2700,39,3200,2.4,""]
["26 Långgropen uppstr Eslöv44368","26 Långgropen uppstr Eslöv6",6,"26 Långgropen uppstr Eslöv","2021-06-21",16.3,5.9,60,7.73,2,66.400000000000006,68,94,29,1200,26,1800,"<2",""]
["26 Långgropen uppstr Eslöv44398","26 Långgropen uppstr Eslöv7",6,"26 Långgropen uppstr Eslöv","2021-07-21",16.100000000000001,7.3,74,7.7,1.9,62.4,77,90,16,1200,30,1800,"<2",""]
["26 Långgropen uppstr Eslöv44438","26 Långgropen uppstr Eslöv8",6,"26 Långgropen uppstr Eslöv","2021-08-30",14.6,8.5,84,7.87,6.5,53.8,"","","","","","","","Analys missad för närsalter och susp"]
["26 Långgropen uppstr Eslöv44468","26 Långgropen uppstr Eslöv9",6,"26 Långgropen uppstr Eslöv","2021-09-29",12.8,8.4,80,7.8,8,58.5,100,140,20,5900,18,6000,3.6,""]
["26 Långgropen uppstr Eslöv44489","26 Långgropen uppstr Eslöv10",6,"26 Långgropen uppstr Eslöv","2021-10-20",12.3,8,75,7.79,40,55.2,65,140,68,6700,"<10",7900,20,""]
[{"$f":"TRIM(CONCATENATE(D67,E67))","v":"26 Långgropen uppstr Eslöv44524"},"26 Långgropen uppstr Eslöv11",6,"26 Långgropen uppstr Eslöv","2021-11-24",7.6,9.6999999999999993,81,7.94,2.8,61.8,33,40,11,7800,23,8100,2.6,""]
["26 Långgropen uppstr Eslöv2021-12-21","26 Långgropen uppstr Eslöv12",6,"26 Långgropen uppstr Eslöv","2021-12-21",2.5,11.4,84,7.7,6.6,53.7,24,39,8,6300,83,6300,4.5999999999999996,""]
["24 Långgropen nedstr Eslöv44221","24 Långgropen nedstr Eslöv1",7,"24 Långgropen nedstr Eslöv","2021-01-25",3.6,11.7,88,7.59,14,47.2,46,84,"",6900,71,7200,5.8,""]
["24 Långgropen nedstr Eslöv44249","24 Långgropen nedstr Eslöv2",7,"24 Långgropen nedstr Eslöv","2021-02-22",2.6,12.4,91,7.69,15,42.7,56,99,"",6000,83,6800,6.4,""]
["24 Långgropen nedstr Eslöv44279","24 Långgropen nedstr Eslöv3",7,"24 Långgropen nedstr Eslöv","2021-03-24",6.1,13.4,108,8.0299999999999994,4.2,60.1,17,35,"",6000,47,6500,2.8,""]
["24 Långgropen nedstr Eslöv44313","24 Långgropen nedstr Eslöv4",7,"24 Långgropen nedstr Eslöv","2021-04-27",6.1,13.4,108,8,2.7,61.5,9,26,"",2900,52,3500,"<2",""]
["24 Långgropen nedstr Eslöv44341","24 Långgropen nedstr Eslöv5",7,"24 Långgropen nedstr Eslöv","2021-05-25",12.4,8.9,84,7.9,1.9,62.5,17,39,"",2400,75,2900,2,""]
["24 Långgropen nedstr Eslöv44368","24 Långgropen nedstr Eslöv6",7,"24 Långgropen nedstr Eslöv","2021-06-21",16.3,5.7,58,7.72,2.6,70.8,70,100,"",1100,52,1600,"<2",""]
["24 Långgropen nedstr Eslöv44398","24 Långgropen nedstr Eslöv7",7,"24 Långgropen nedstr Eslöv","2021-07-21",16,6.6,67,7.67,2.5,65.2,78,92,"",1100,49,1500,2.5,""]
["24 Långgropen nedstr Eslöv44438","24 Långgropen nedstr Eslöv8",7,"24 Långgropen nedstr Eslöv","2021-08-30",14.7,8.1,80,7.83,7.3,53.5,"","","","","","","","Analys missad för närsalter och susp"]
["24 Långgropen nedstr Eslöv44468",{"$f":"CONCATENATE(D77,MONTH(E77))","v":"24 Långgropen nedstr Eslöv9"},7,"24 Långgropen nedstr Eslöv","2021-09-29",12.8,8.6,82,7.77,6.5,55.4,99,130,"",4400,26,4800,3.1,""]
["24 Långgropen nedstr Eslöv44489","24 Långgropen nedstr Eslöv10",7,"24 Långgropen nedstr Eslöv","2021-10-20",12.5,8,75,7.79,13,46.5,46,86,"",4300,77,5100,9.3000000000000007,""]
["24 Långgropen nedstr Eslöv44524","24 Långgropen nedstr Eslöv11",7,"24 Långgropen nedstr Eslöv","2021-11-24",7.5,9.6999999999999993,81,7.92,2.8,62.5,34,39,"",7400,37,7600,"<2",""]
["24 Långgropen nedstr Eslöv2021-12-21","24 Långgropen nedstr Eslöv12",7,"24 Långgropen nedstr Eslöv","2021-12-21",2.2000000000000002,11.6,84,7.73,6.8,55.4,25,49,"",5900,130,5600,5.5,""]
["19 Saxån vid Annelöv44249","19 Saxån vid Annelöv2",8,"19 Saxån vid Annelöv","2021-02-22",3.2,13.2,99,7.97,17,44.7,65,110,"",6000,41,6300,15,""]
["19 Saxån vid Annelöv44279","19 Saxån vid Annelöv3",8,"19 Saxån vid Annelöv","2021-03-24",5.9,12.4,100,8.2100000000000009,5.6,60,23,39,"",5900,16,6700,4.8,""]
["19 Saxån vid Annelöv44341","19 Saxån vid Annelöv5",8,"19 Saxån vid Annelöv","2021-05-25",12.9,8.1999999999999993,78,8.14,2,61.5,39,63,"",2700,60,3000,"<2",""]
["19 Saxån vid Annelöv44438","19 Saxån vid Annelöv8",8,"19 Saxån vid Annelöv","2021-08-30",15.9,9.9,100,7.96,2.5,41,"","","","","","","","Analys missad för närsalter och susp"]
["19 Saxån vid Annelöv44489","19 Saxån vid Annelöv10",8,"19 Saxån vid Annelöv","2021-10-20",11.5,8.8000000000000007,81,7.96,2.6,64.099999999999994,56,73,"",4900,"<10",6000,3.4,""]
["19 Saxån vid Annelöv2021-12-21","19 Saxån vid Annelöv12",8,"19 Saxån vid Annelöv","2021-12-21",2.6,12.8,94,8,7.8,56.3,39,65,"",6100,75,5900,7.3,""]
["30 Välabäcken44221","30 Välabäcken1",9,"30 Välabäcken","2021-01-25",4.0999999999999996,11.7,90,7.81,4.9000000000000004,76.099999999999994,40,89,26,15000,"<10",15000,4.2,""]
["30 Välabäcken44249","30 Välabäcken2",9,"30 Välabäcken","2021-02-22",3.2,12.7,95,7.86,13,59.4,74,110,36,10000,15,11000,10,""]
["30 Välabäcken44279","30 Välabäcken3",9,"30 Välabäcken","2021-03-24",6.4,13.9,113,8.23,1.6,76.400000000000006,14,37,20,12000,"<10",13000,"<2",""]
["30 Välabäcken44313","30 Välabäcken4",9,"30 Välabäcken","2021-04-27",5.6,13.1,104,7.99,1.6,79.099999999999994,4.4000000000000004,46,19,7200,69,8200,"<2",""]
["30 Välabäcken44341","30 Välabäcken5",9,"30 Välabäcken","2021-05-25",11.6,10.7,99,8.1300000000000008,1.2,77.3,63,110,22,5100,46,5500,"<2",""]
["30 Välabäcken44368","30 Välabäcken6",9,"30 Välabäcken","2021-06-21",15,7.2,72,7.84,1.2,79.400000000000006,140,210,60,4200,130,5300,7.8,""]
["30 Välabäcken44398","30 Välabäcken7",9,"30 Välabäcken","2021-07-21",15.4,7.4,74,7.84,1.2,79.3,230,310,60,3000,140,4000,11,""]
["30 Välabäcken44438","30 Välabäcken8",9,"30 Välabäcken","2021-08-30",15.2,9.6999999999999993,97,7.89,1.1000000000000001,74.400000000000006,"","","","","","","","Analys missad för närsalter och susp"]
["30 Välabäcken44468","30 Välabäcken9",9,"30 Välabäcken","2021-09-29",12.2,9.6,90,7.8,1.8,76.2,130,140,10,4200,19,4600,"<2",""]
["30 Välabäcken44489","30 Välabäcken10",9,"30 Välabäcken","2021-10-20",12.6,8.3000000000000007,78,7.9,2.2999999999999998,81.3,71,87,11,8800,15,9900,3,""]
["30 Välabäcken44524","30 Välabäcken11",9,"30 Välabäcken","2021-11-24",8.4,10,86,8.11,1,83.7,70,74,5,12000,34,12000,"<2",""]
["30 Välabäcken2021-12-21","30 Välabäcken12",9,"30 Välabäcken","2021-12-21",3.5,12.1,91,7.94,3.1,78.7,45,49,"<5,0",14000,60,13000,"<2",""]
[{"$f":"TRIM(CONCATENATE(D99,E99))","v":"16 Saxån vid Saxtorp44221"},"16 Saxån vid Saxtorp1",10,"16 Saxån vid Saxtorp","2021-01-25",3.3,12.8,96,7.99,15,54.7,36,100,37,9200,"<10",9200,9.3000000000000007,""]
["16 Saxån vid Saxtorp44249","16 Saxån vid Saxtorp2",10,"16 Saxån vid Saxtorp","2021-02-22",3.1,12.8,95,7.96,19,44.9,80,130,49,6700,69,7100,13,""]
["16 Saxån vid Saxtorp44279","16 Saxån vid Saxtorp3",10,"16 Saxån vid Saxtorp","2021-03-24",5.7,12.4,99,8.19,4.5999999999999996,65,29,48,17,7800,22,9000,3.2,""]
["16 Saxån vid Saxtorp44313","16 Saxån vid Saxtorp4",10,"16 Saxån vid Saxtorp","2021-04-27",7.6,11.6,97,8.02,2.4,64.599999999999994,24,43,16,4000,30,4800,"<2",""]
["16 Saxån vid Saxtorp44341","16 Saxån vid Saxtorp5",10,"16 Saxån vid Saxtorp","2021-05-25",12.5,8.9,84,8.16,1.9,66,55,77,15,3700,63,4000,"<2",""]
["16 Saxån vid Saxtorp44368","16 Saxån vid Saxtorp6",10,"16 Saxån vid Saxtorp","2021-06-21",18.8,6.1,66,7.92,1.2,70.5,170,190,20,2900,70,3600,"<2",""]
["16 Saxån vid Saxtorp44398","16 Saxån vid Saxtorp7",10,"16 Saxån vid Saxtorp","2021-07-21",18.2,7.2,76,7.96,1.8,62.4,170,200,10,2000,34,2700,"<2",""]
["16 Saxån vid Saxtorp44438","16 Saxån vid Saxtorp8",10,"16 Saxån vid Saxtorp","2021-08-30",16,11.3,115,8.1199999999999992,3.6,61.2,"","","","","","","","Analys missad för närsalter och susp"]
["16 Saxån vid Saxtorp44468","16 Saxån vid Saxtorp9",10,"16 Saxån vid Saxtorp","2021-09-29",13.7,9.3000000000000007,90,7.88,5.0999999999999996,66.7,110,130,20,3600,16,3800,2.8,""]
["16 Saxån vid Saxtorp44489","16 Saxån vid Saxtorp10",10,"16 Saxån vid Saxtorp","2021-10-20",12.1,9.3000000000000007,87,8.02,4.5,67.900000000000006,69,95,21,6100,"<10",7100,3.8,""]
["16 Saxån vid Saxtorp44524","16 Saxån vid Saxtorp11",10,"16 Saxån vid Saxtorp","2021-11-24",7.1,10.8,89,8.23,3.5,67.5,59,64,11,8200,25,8600,2.7,""]
["16 Saxån vid Saxtorp2021-12-21","16 Saxån vid Saxtorp12",10,"16 Saxån vid Saxtorp","2021-12-21",2.7,12.4,91,8.07,6.6,61.9,45,350,300,8200,73,7600,6.2,""]

{"sheet":"Sorterat","index":3,"n_rows":153,"n_cols":43,"rows_kept":153,"cut":false,"hidden":false,"merged":[[4,18,4,19]]}
[]
[null,"Saxån-Braån 2021"]
[null,"Sorterat per provpunkt"]
[null,null,null,"Värden < a räknas som a vid beräkning av statistik",null,null,null,null,null,null,null,null,null,null,null,null,null,null,null,null,null,null,null,null,null,null,null,null,null,null,"<-värden omvandlade till värden. Medelvärde hämtas här"]
["Sorterings-","Provtagningspunkt","Provtagn"," Temp"," Syreh","Syrem","  pH","Gruml","Kond","PO4-P","Tot-P","Part.-P"," NO3+2-N","NH4-N"," Tot-N","Susp","Anmärkning","provtagare/projektledare",null,null,null,null,null,null,null,null,null,null,null,null," Temp"," Syreh","Syrem","  pH","Gruml","BOD7","Susp","PO4-P","Tot-P"," NO3+2-N","NH4-N"," Tot-N","Susp"]
["ordning","Nr Läge","datum","  °C","mg/l","%",null,"  FNU","mS/m"," µg/l"," µg/l","µg/l","  µg/l","  µg/l","  µg/l","mg/l",null,null,null,null,null,null,null,null,null,null,null,null,null,null,"  °C","mg/l","%",null,"  FNU","mg/l","mg/l"," µg/l"," µg/l","  µg/l","  µg/l","  µg/l","mg/l"]
[1,"14 Svalövsbäcken uppstr Svalöv","2021-01-25",3,12.7,94,7.55,9.5,39.299999999999997,21,48,16,8900,28,8800,3.4,"Resultatet av kväve total, N, är mindre än summanav ammoniumkväve, NH4-N, och nitrat + nitritkväve, NO23-N. Skillnaden ligger dock inommätosäkerheten.",null,null,null,null,null,null,null,null,null,null,null,null,null,3,12.7,94,7.55,9.5,39.299999999999997,21,48,16,8900,28,8800,{"$f":"IF(OR(LEFT(P7,1)=\"<\",LEFT(P7,1)=\">\"),VALUE(MID(P7,2,5)),P7)","v":3.4}]
[1,"14 Svalövsbäcken uppstr Svalöv","2021-02-22",2.8,12.2,90,7.46,12,36.5,25,75,43,6500,11,7200,4,"",null,null,null,null,null,null,null,null,null,null,null,null,null,2.8,12.2,90,7.46,12,36.5,25,75,43,6500,11,7200,{"$f":"IF(OR(LEFT(P8,1)=\"<\",LEFT(P8,1)=\">\"),VALUE(MID(P8,2,5)),P8)","v":4}]
[1,"14 Svalövsbäcken uppstr Svalöv","2021-03-24",5.5,12.6,100,7.96,4.0999999999999996,40.799999999999997,9.3000000000000007,22,9,5800,16,6700,2.2000000000000002,"",null,null,null,null,null,null,null,null,null,null,null,null,null,5.5,12.6,100,7.96,4.0999999999999996,40.799999999999997,9.3000000000000007,22,9,5800,16,6700,2.2000000000000002]
[1,"14 Svalövsbäcken uppstr Svalöv","2021-04-27",9.1,11.9,104,8.25,8,44.6,6.8,41,29,2200,39,3000,5.6,"",null,null,null,null,null,null,null,null,null,null,null,null,null,9.1,11.9,104,8.25,8,44.6,6.8,41,29,2200,39,3000,5.6]
[1,"14 Svalövsbäcken uppstr Svalöv","2021-05-25",14.4,8.3000000000000007,82,8.09,8.1999999999999993,46.9,12,56,31,2100,70,2700,9.6999999999999993,"",null,null,null,null,null,null,null,null,null,null,null,null,null,14.4,8.3000000000000007,82,8.09,8.1999999999999993,46.9,12,56,31,2100,70,2700,9.6999999999999993]
[1,"14 Svalövsbäcken uppstr Svalöv","2021-06-21",21.2,3.3,37,7.7,6.4,51.1,56,130,50,640,41,1800,6.5,"",null,null,null,null,null,null,null,null,null,null,null,null,null,21.2,3.3,37,7.7,6.4,51.1,56,130,50,640,41,1800,6.5]
[1,"14 Svalövsbäcken uppstr Svalöv","2021-07-21",21.3,4.5,51,7.85,13.8,42.7,56,160,74,290,55,1700,11,"",null,null,null,null,null,null,null,null,null,null,null,null,null,21.3,4.5,51,7.85,13.8,42.7,56,160,74,290,55,1700,11]
[1,"14 Svalövsbäcken uppstr Svalöv","2021-08-30",16.8,11.3,117,8.5299999999999994,20,47.6,"","","","","","","","Analys missad för närsalter och susp",null,null,null,null,null,null,null,null,null,null,null,null,null,16.8,11.3,117,8.5299999999999994,20,47.6,"","","","","","",""]
[1,"14 Svalövsbäcken uppstr Svalöv","2021-09-29",14.3,10.5,103,7.98,15,52.4,4.8,85,61,2200,41,2900,14,"",null,null,null,null,null,null,null,null,null,null,null,null,null,14.3,10.5,103,7.98,15,52.4,4.8,85,61,2200,41,2900,14]
[1,"14 Svalövsbäcken uppstr Svalöv","2021-10-20",11.2,9.5,87,7.67,10,51.4,17,57,32,6900,41,8200,12,"",null,null,null,null,null,null,null,null,null,null,null,null,null,11.2,9.5,87,7.67,10,51.4,17,57,32,6900,41,8200,12]
[1,"14 Svalövsbäcken uppstr Svalöv","2021-11-24",6.7,10.5,86,8.39,4.5999999999999996,51.2,23,37,11,6200,53,6300,4.5,"",null,null,null,null,null,null,null,null,null,null,null,null,null,6.7,10.5,86,8.39,4.5999999999999996,51.2,23,37,11,6200,53,6300,4.5]
[1,"14 Svalövsbäcken uppstr Svalöv","2021-12-21",2.2000000000000002,12.5,91,7.7,5.0999999999999996,41.5,14,26,5,7100,42,7000,3.4,"",null,null,null,null,null,null,null,null,null,null,null,null,null,2.2000000000000002,12.5,91,7.7,5.0999999999999996,41.5,14,26,5,7100,42,7000,3.4]
[null,null,"Medel",10.708333333333334,9.9833333333333325,86.833333333333329,7.9275000000000011,9.7249999999999996,45.5,22.263636363636365,67,32.81818181818182,4439.090909090909,39.727272727272727,5118.181818181818,6.9363636363636374,null,null,null,null,null,null,null,null,null,null,null,null,null,null,10.708333333333334,9.9833333333333325,86.833333333333329,7.9275000000000011,9.7249999999999996,45.5,22.263636363636365,67,32.81818181818182,4439.090909090909,39.727272727272727,5118.181818181818,6.9363636363636374]
[null,null,"Max",21.3,12.7,117,8.5299999999999994,20,52.4,56,160,74,8900,70,8800,14,null,null,null,null,null,null,null,null,null,null,null,null,null,null,21.3,12.7,117,8.5299999999999994,20,52.4,56,160,74,8900,70,8800,14]
[null,null,"Min",2.2000000000000002,3.3,37,7.46,4.0999999999999996,36.5,4.8,22,5,290,11,1700,2.2000000000000002,null,null,null,null,null,null,null,null,null,null,null,null,null,null,2.2000000000000002,3.3,37,7.46,4.0999999999999996,36.5,4.8,22,5,290,11,1700,2.2000000000000002]
[null,null,null,null,null,null,null,null,null,null,null,null,null,null,null,null,null,null,null,null,null,null,null,null,null,null,null,null,null,null,0,0,0,0,0,0,0,0,0,0,0,0,0]
[2,"15:2 Svalövsbäcken nedstr Svalöv","2021-01-25",3.6,12.8,97,7.76,13,45.1,28,64,"",8700,290,8900,5.0999999999999996,"",null,null,null,null,null,null,null,null,null,null,null,null,null,3.6,12.8,97,7.76,13,45.1,28,64,"",8700,290,8900,5.0999999999999996]
[2,"15:2 Svalövsbäcken nedstr Svalöv","2021-02-22",3.2,12.9,96,7.69,14,39.9,32,81,"",6600,160,7500,6.8,"",null,null,null,null,null,null,null,null,null,null,null,null,null,3.2,12.9,96,7.69,14,39.9,32,81,"",6600,160,7500,6.8]
[2,"15:2 Svalövsbäcken nedstr Svalöv","2021-03-24",6.5,12.8,104,8.0399999999999991,4.0999999999999996,48.8,16,32,"",6200,610,7400,3,"",null,null,null,null,null,null,null,null,null,null,null,null,null,6.5,12.8,104,8.0399999999999991,4.0999999999999996,48.8,16,32,"",6200,610,7400,3]
[2,"15:2 Svalövsbäcken nedstr Svalöv","2021-04-27",6.6,14.8,121,8.1,3.7,54.2,7.8,27,"",3700,600,4900,"<2","",null,null,null,null,null,null,null,null,null,null,null,null,null,6.6,14.8,121,8.1,3.7,54.2,7.8,27,"",3700,600,4900,2]
[2,"15:2 Svalövsbäcken nedstr Svalöv","2021-05-25",12.4,9.6,90,8,1.8,56.4,14,39,"",4000,67,4400,"<2","",null,null,null,null,null,null,null,null,null,null,null,null,null,12.4,9.6,90,8,1.8,56.4,14,39,"",4000,67,4400,2]
[2,"15:2 Svalövsbäcken nedstr Svalöv","2021-06-21",16.5,6.8,70,7.65,1.2,69.099999999999994,72,110,"",9500,110,10000,"<2",""]
[2,"15:2 Svalövsbäcken nedstr Svalöv","2021-07-21",17.399999999999999,7.7,80,7.74,4.8,66.400000000000006,72,98,"",7200,110,7800,3.3,""]
[2,"15:2 Svalövsbäcken nedstr Svalöv","2021-08-30",16.2,9.6,98,8.02,7.1,55.8,"","","","","","","","Analys missad för närsalter och susp"]
[2,"15:2 Svalövsbäcken nedstr Svalöv","2021-09-29",13.5,10.3,99,7.97,13,55.9,33,110,"",4000,110,4500,12,""]
[2,"15:2 Svalövsbäcken nedstr Svalöv","2021-10-20",12.1,9.3000000000000007,87,7.75,55,52.4,30,220,"",7200,"<10",8700,86,""]
[2,"15:2 Svalövsbäcken nedstr Svalöv","2021-11-24",7.7,11.5,97,8.0399999999999991,3.9,57.4,45,60,"",6600,350,7100,3.7,""]
[2,"15:2 Svalövsbäcken nedstr Svalöv","2021-12-21",2.5,12.8,94,7.8,5.4,47.8,23,36,"",7300,400,7200,3.5,"",null,null,null,null,null,null,null,null,null,null,null,null,null,2.5,12.8,94,7.8,5.4,47.8,23,36,"",7300,400,7200,3.5]
[null,null,"Medel",5.8,12.616666666666667,100.33333333333333,7.8983333333333325,7,48.699999999999996,null,46.5,{"$error":"#DIV/0!"},6083.333333333333,354.5,6716.666666666667,3.7333333333333329,null,null,null,null,null,null,null,null,null,null,null,null,null,null,5.8,12.616666666666667,100.33333333333333,7.8983333333333325,7,48.699999999999996,0,46.5,{"$error":"#DIV/0!"},6083.333333333333,354.5,6716.666666666667,3.7333333333333329]
[null,null,"Max",12.4,14.8,121,8.1,14,56.4,null,81,0,8700,610,8900,6.8,null,null,null,null,null,null,null,null,null,null,null,null,null,null,12.4,14.8,121,8.1,14,56.4,0,81,0,8700,610,8900,6.8]
[null,null,"Min",2.5,9.6,90,7.69,1.8,39.9,null,27,0,3700,67,4400,2,null,null,null,null,null,null,null,null,null,null,null,null,null,null,2.5,9.6,90,7.69,1.8,39.9,0,27,0,3700,67,4400,2]
[null,null,null,null,null,null,null,null,null,null,null,null,null,null,null,null,null,null,null,null,null,null,null,null,null,null,null,null,null,null,0,0,0,0,0,0,0,0,0,0,0,0,0]
[3,"3:2 Örstorpsbäcken","2021-01-25",4.2,11.9,91,7.9,9.1,69,57,210,60,16000,35,17000,6.3,"",null,null,null,null,null,null,null,null,null,null,null,null,null,4.2,11.9,91,7.9,9.1,69,57,210,60,16000,35,17000,6.3]
[3,"3:2 Örstorpsbäcken","2021-02-22",3.6,12.4,94,7.85,11,58.5,70,110,36,13000,"<10",13000,4.4000000000000004,"",null,null,null,null,null,null,null,null,null,null,null,null,null,3.6,12.4,94,7.85,11,58.5,70,110,36,13000,10,13000,4.4000000000000004]
[3,"3:2 Örstorpsbäcken","2021-03-24",5.6,13.1,104,8.11,2.6,72.8,59,75,13,13000,10,15000,"<2","",null,null,null,null,null,null,null,null,null,null,null,null,null,5.6,13.1,104,8.11,2.6,72.8,59,75,13,13000,10,15000,2]
[3,"3:2 Örstorpsbäcken","2021-04-27",5.5,11.4,91,8,3.8,70.900000000000006,88,120,31,6400,26,7300,3.3,"",null,null,null,null,null,null,null,null,null,null,null,null,null,5.5,11.4,91,8,3.8,70.900000000000006,88,120,31,6400,26,7300,3.3]
[3,"3:2 Örstorpsbäcken","2021-05-25",11.6,8.5,78,8.02,2,72.099999999999994,110,140,20,6300,57,6600,2.4,""]
[3,"3:2 Örstorpsbäcken","2021-06-21",16.5,7,72,7.91,2.8,73.5,280,280,40,3800,64,4700,2.2000000000000002,""]
[3,"3:2 Örstorpsbäcken","2021-07-21",15.9,8.3000000000000007,84,7.94,5.6,72.8,280,300,30,5200,35,5800,5.0999999999999996,""]
[3,"3:2 Örstorpsbäcken","2021-08-30",15.3,11.6,116,8,11,71.8,"","","","","","","","Analys missad för närsalter och susp"]
[3,"3:2 Örstorpsbäcken","2021-09-29",13.4,11,106,7.94,7.1,73.099999999999994,130,150,20,12000,24,11000,3.1,""]
[3,"3:2 Örstorpsbäcken","2021-10-20",12.4,8.6,81,7.83,78,67.400000000000006,140,250,100,12000,16,14000,22,""]
[3,"3:2 Örstorpsbäcken","2021-11-24",8.1999999999999993,10.1,86,8.0399999999999991,2.7,79.099999999999994,120,110,10,13000,20,13000,2.2000000000000002,"",null,null,null,null,null,null,null,null,null,null,null,null,null,8.1999999999999993,10.1,86,8.0399999999999991,2.7,79.099999999999994,120,110,10,13000,20,13000,2.2000000000000002]
[3,"3:2 Örstorpsbäcken","2021-12-21",3.4,11.9,89,7.82,6.2,74.7,76,100,19,14000,48,13000,6.2,"",null,null,null,null,null,null,null,null,null,null,null,null,null,3.4,11.9,89,7.82,6.2,74.7,76,100,19,14000,48,13000,6.2]
[null,null,"Medel",5.083333333333333,11.799999999999999,92.5,7.9533333333333331,5.9000000000000012,70.833333333333343,null,120.83333333333333,28.166666666666668,12566.666666666666,24.833333333333332,13050,4.0666666666666664,null,null,null,null,null,null,null,null,null,null,null,null,null,null,5.083333333333333,11.799999999999999,92.5,7.9533333333333331,5.9000000000000012,70.833333333333343,0,120.83333333333333,28.166666666666668,12566.666666666666,24.833333333333332,13050,4.0666666666666664]
[null,null,"Max",8.1999999999999993,13.1,104,8.11,11,79.099999999999994,null,210,60,16000,48,17000,6.3,null,null,null,null,null,null,null,null,null,null,null,null,null,null,8.1999999999999993,13.1,104,8.11,11,79.099999999999994,0,210,60,16000,48,17000,6.3]
[null,null,"Min",3.4,10.1,86,7.82,2.6,58.5,null,75,10,6400,10,7300,2,null,null,null,null,null,null,null,null,null,null,null,null,null,null,3.4,10.1,86,7.82,2.6,58.5,0,75,10,6400,10,7300,2]
[null,null,null,null,null,null,null,null,null,null,null,null,null,null,null,null,null,null,null,null,null,null,null,null,null,null,null,null,null,null,0,0,0,0,0,0,0,0,0,0,0,0,0]
[4,"5 Braån vid Asmundtorp","2021-01-25",3.3,12.6,94,7.92,14,49,42,81,30,8900,72,8900,7.2,"",null,null,null,null,null,null,null,null,null,null,null,null,null,3.3,12.6,94,7.92,14,49,42,81,30,8900,72,8900,7.2]
[4,"5 Braån vid Asmundtorp","2021-02-22",3.3,12.9,97,7.91,19,41.4,60,110,46,7400,64,7900,9.6,"",null,null,null,null,null,null,null,null,null,null,null,null,null,3.3,12.9,97,7.91,19,41.4,60,110,46,7400,64,7900,9.6]
[4,"5 Braån vid Asmundtorp","2021-03-24",5.7,12.8,102,8.15,3.8,54.3,21,41,14,6800,48,7600,2.8,"",null,null,null,null,null,null,null,null,null,null,null,null,null,5.7,12.8,102,8.15,3.8,54.3,21,41,14,6800,48,7600,2.8]
[4,"5 Braån vid Asmundtorp","2021-04-27",6.2,10.9,88,8.0299999999999994,2,57.7,14,30,10,3900,26,4600,"<2","",null,null,null,null,null,null,null,null,null,null,null,null,null,6.2,10.9,88,8.0299999999999994,2,57.7,14,30,10,3900,26,4600,2]
[4,"5 Braån vid Asmundtorp","2021-05-25",11.8,8.4,78,8.06,2.1,59.8,45,66,11,4100,47,4500,2.4,"",null,null,null,null,null,null,null,null,null,null,null,null,null,11.8,8.4,78,8.06,2.1,59.8,45,66,11,4100,47,4500,2.4]
[4,"5 Braån vid Asmundtorp","2021-06-21",18.399999999999999,6.7,71,7.97,2.9,67.8,170,180,20,2900,51,3700,3,""]
[4,"5 Braån vid Asmundtorp","2021-07-21",17.3,7.6,79,7.99,4.3,59.8,160,180,10,1900,27,2300,3.2,""]
[4,"5 Braån vid Asmundtorp","2021-08-30",16.399999999999999,11.7,120,8.08,4.5999999999999996,52.4,"","","","","","","","Analys missad för närsalter och susp"]
[4,"5 Braån vid Asmundtorp","2021-09-29",13.9,10.6,103,7.97,21,47.5,230,280,60,5300,53,5600,11,""]
[4,"5 Braån vid Asmundtorp","2021-10-20",12.1,9.3000000000000007,87,7.98,22,57.7,180,230,40,7500,15,8700,18,""]
[4,"5 Braån vid Asmundtorp","2021-11-24",7.4,10.6,88,8.18,4.2,61.4,84,86,8,8200,14,8200,2.7,""]
[4,"5 Braån vid Asmundtorp","2021-12-21",2.8,12.6,93,8.01,6.6,52.5,60,87,14,7700,110,7200,5.7,"",null,null,null,null,null,null,null,null,null,null,null,null,null,2.8,12.6,93,8.01,6.6,52.5,60,87,14,7700,110,7200,5.7]
[null,null,"Medel",5.5166666666666666,11.699999999999998,92,8.0133333333333336,7.916666666666667,52.449999999999996,null,69.166666666666671,20.833333333333332,6466.666666666667,61.166666666666664,6783.333333333333,4.95,null,null,null,null,null,null,null,null,null,null,null,null,null,null,5.5166666666666666,11.699999999999998,92,8.0133333333333336,7.916666666666667,52.449999999999996,0,69.166666666666671,20.833333333333332,6466.666666666667,61.166666666666664,6783.333333333333,4.95]
[null,null,"Max",11.8,12.9,102,8.15,19,59.8,null,110,46,8900,110,8900,9.6,null,null,null,null,null,null,null,null,null,null,null,null,null,null,11.8,12.9,102,8.15,19,59.8,0,110,46,8900,110,8900,9.6]
[null,null,"Min",2.8,8.4,78,7.91,2,41.4,null,30,10,3900,26,4500,2,null,null,null,null,null,null,null,null,null,null,null,null,null,null,2.8,8.4,78,7.91,2,41.4,0,30,10,3900,26,4500,2]
[null,null,null,null,null,null,null,null,null,null,null,null,null,null,null,null,null,null,null,null,null,null,null,null,null,null,null,null,null,null,0,0,0,0,0,0,0,0,0,0,0,0,0]
[5,"28:2 Bäck N Trolleholm","2021-02-22",1.6,13.3,95,7.75,5.3,36.6,5,22,"",2300,52,2500,3,"Is låg kvar i bäcken, vattnet rann ovan is.",null,null,null,null,null,null,null,null,null,null,null,null,null,1.6,13.3,95,7.75,5.3,36.6,5,22,"",2300,52,2500,3]
[5,"28:2 Bäck N Trolleholm","2021-03-24",6.7,11.8,97,8.1,2.5,44.6,4.0999999999999996,10,"",1500,11,2200,2.2999999999999998,"",null,null,null,null,null,null,null,null,null,null,null,null,null,6.7,11.8,97,8.1,2.5,44.6,4.0999999999999996,10,"",1500,11,2200,2.2999999999999998]
[5,"28:2 Bäck N Trolleholm","2021-05-25",11.2,9.8000000000000007,90,8.1999999999999993,1.6,52.1,5,11,"",460,13,740,2.1,"",null,null,null,null,null,null,null,null,null,null,null,null,null,11.2,9.8000000000000007,90,8.1999999999999993,1.6,52.1,5,11,"",460,13,740,2.1]
[5,"28:2 Bäck N Trolleholm","2021-08-30",14.6,10.9,108,8.1300000000000008,5.3,50.2,"","","","","","","","Analys missad för närsalter och susp",null,null,null,null,null,null,null,null,null,null,null,null,null,14.6,10.9,108,8.1300000000000008,5.3,50.2,"","","","","","",""]
[5,"28:2 Bäck N Trolleholm","2021-10-20",12.4,9.4,88,7.91,22,43.9,6.4,67,"",1600,"<10",2500,24,"",null,null,null,null,null,null,null,null,null,null,null,null,null,12.4,9.4,88,7.91,22,43.9,6.4,67,"",1600,10,2500,24]
[5,"28:2 Bäck N Trolleholm","2021-12-21",0.3,13.7,94,7.97,2.8,38.200000000000003,3,12,"",1400,27,1700,"<2","",null,null,null,null,null,null,null,null,null,null,null,null,null,0.3,13.7,94,7.97,2.8,38.200000000000003,3,12,"",1400,27,1700,2]
[null,null,"Medel",7.8,11.483333333333334,95.333333333333329,8.01,6.583333333333333,44.266666666666673,null,24.4,{"$error":"#DIV/0!"},1452,22.6,1928,6.68,null,null,null,null,null,null,null,null,null,null,null,null,null,null,7.8,11.483333333333334,95.333333333333329,8.01,6.583333333333333,44.266666666666673,0,24.4,{"$error":"#DIV/0!"},1452,22.6,1928,6.68]
[null,null,"Max",14.6,13.7,108,8.1999999999999993,22,52.1,null,67,0,2300,52,2500,24,null,null,null,null,null,null,null,null,null,null,null,null,null,null,14.6,13.7,108,8.1999999999999993,22,52.1,0,67,0,2300,52,2500,{"$f":"IF(OR(LEFT(P78,1)=\"<\",LEFT(P78,1)=\">\"),VALUE(MID(P78,2,5)),P78)","v":24}]
[null,null,"Min",0.3,9.4,88,7.75,1.6,36.6,null,10,0,460,10,740,2,null,null,null,null,null,null,null,null,null,null,null,null,null,null,0.3,9.4,88,7.75,1.6,36.6,0,10,0,460,10,740,2]
[null,null,null,null,null,null,null,null,null,null,null,null,null,null,null,null,null,null,null,null,null,null,null,null,null,null,null,null,null,null,0,0,0,0,0,0,0,0,0,0,0,0,0]
[6,"26 Långgropen uppstr Eslöv","2021-01-25",3.3,11.3,85,7.53,14,45.6,45,86,31,7100,65,7400,5.7,"",null,null,null,null,null,null,null,null,null,null,null,null,null,3.3,11.3,85,7.53,14,45.6,45,86,31,7100,65,7400,5.7]
[6,"26 Långgropen uppstr Eslöv","2021-02-22",2.9,12.5,93,7.64,16,40.700000000000003,55,98,36,6300,73,7000,3.9,"",null,null,null,null,null,null,null,null,null,null,null,null,null,2.9,12.5,93,7.64,16,40.700000000000003,55,98,36,6300,73,7000,3.9]
[6,"26 Långgropen uppstr Eslöv","2021-03-24",6.4,13.9,113,8.08,4.5,57.4,15,36,19,6100,18,7000,2.6,"",null,null,null,null,null,null,null,null,null,null,null,null,null,6.4,13.9,113,8.08,4.5,57.4,15,36,19,6100,18,7000,2.6]
[6,"26 Långgropen uppstr Eslöv","2021-04-27",6.1,17.100000000000001,138,8.26,1.8,60.3,2.7,18,12,3700,"<10",4300,"<2","",null,null,null,null,null,null,null,null,null,null,null,null,null,6.1,17.100000000000001,138,8.26,1.8,60.3,2.7,18,12,3700,10,4300,2]
[6,"26 Långgropen uppstr Eslöv","2021-05-25",12.6,9.9,93,8.02,1.8,62.5,11,33,17,2700,39,3200,2.4,"",null,null,null,null,null,null,null,null,null,null,null,null,null,12.6,9.9,93,8.02,1.8,62.5,11,33,17,2700,39,3200,2.4]
[6,"26 Långgropen uppstr Eslöv","2021-06-21",16.3,5.9,60,7.73,2,66.400000000000006,68,94,29,1200,26,1800,"<2",""]
[6,"26 Långgropen uppstr Eslöv","2021-07-21",16.100000000000001,7.3,74,7.7,1.9,62.4,77,90,16,1200,30,1800,"<2",""]
[6,"26 Långgropen uppstr Eslöv","2021-08-30",14.6,8.5,84,7.87,6.5,53.8,"","","","","","","","Analys missad för närsalter och susp"]
[6,"26 Långgropen uppstr Eslöv","2021-09-29",12.8,8.4,80,7.8,8,58.5,100,140,20,5900,18,6000,3.6,""]
[6,"26 Långgropen uppstr Eslöv","2021-10-20",12.3,8,75,7.79,40,55.2,65,140,68,6700,"<10",7900,20,""]
[6,"26 Långgropen uppstr Eslöv","2021-11-24",7.6,9.6999999999999993,81,7.94,2.8,61.8,33,40,11,7800,23,8100,2.6,""]
[6,"26 Långgropen uppstr Eslöv","2021-12-21",2.5,11.4,84,7.7,6.6,53.7,24,39,8,6300,83,6300,4.5999999999999996,"",null,null,null,null,null,null,null,null,null,null,null,null,null,2.5,11.4,84,7.7,6.6,53.7,24,39,8,6300,83,6300,4.5999999999999996]
[null,null,"Medel",5.6333333333333329,12.683333333333335,101,7.871666666666667,7.4499999999999993,53.366666666666667,null,51.666666666666664,20.5,5366.666666666667,48,5866.666666666667,3.5333333333333328,null,null,null,null,null,null,null,null,null,null,null,null,null,null,5.6333333333333329,12.683333333333335,101,7.871666666666667,7.4499999999999993,53.366666666666667,0,51.666666666666664,20.5,5366.666666666667,48,5866.666666666667,3.5333333333333328]
[null,null,"Max",12.6,17.100000000000001,138,8.26,16,62.5,null,98,36,7100,83,7400,5.7,null,null,null,null,null,null,null,null,null,null,null,null,null,null,12.6,17.100000000000001,138,8.26,16,62.5,0,98,36,7100,83,7400,5.7]
[null,null,"Min",2.5,9.9,84,7.53,1.8,40.700000000000003,null,18,8,2700,10,3200,2,null,null,null,null,null,null,null,null,null,null,null,null,null,null,2.5,9.9,84,7.53,1.8,40.700000000000003,0,18,8,2700,10,3200,2]
[null,null,null,null,null,null,null,null,null,null,null,null,null,null,null,null,null,null,null,null,null,null,null,null,null,null,null,null,null,null,0,0,0,0,0,0,0,0,0,0,0,0,0]
[7,"24 Långgropen nedstr Eslöv","2021-01-25",3.6,11.7,88,7.59,14,47.2,46,84,"",6900,71,7200,5.8,"",null,null,null,null,null,null,null,null,null,null,null,null,null,3.6,11.7,88,7.59,14,47.2,46,84,"",6900,71,7200,5.8]
[7,"24 Långgropen nedstr Eslöv","2021-02-22",2.6,12.4,91,7.69,15,42.7,56,99,"",6000,83,6800,6.4,"",null,null,null,null,null,null,null,null,null,null,null,null,null,2.6,12.4,91,7.69,15,42.7,56,99,"",6000,83,6800,6.4]
[7,"24 Långgropen nedstr Eslöv","2021-03-24",6.1,13.4,108,8.0299999999999994,4.2,60.1,17,35,"",6000,47,6500,2.8,"",null,null,null,null,null,null,null,null,null,null,null,null,null,6.1,13.4,108,8.0299999999999994,4.2,60.1,17,35,"",6000,47,6500,2.8]
[7,"24 Långgropen nedstr Eslöv","2021-04-27",6.1,13.4,108,8,2.7,61.5,9,26,"",2900,52,3500,"<2","",null,null,null,null,null,null,null,null,null,null,null,null,null,6.1,13.4,108,8,2.7,61.5,9,26,"",2900,52,3500,2]
[7,"24 Långgropen nedstr Eslöv","2021-05-25",12.4,8.9,84,7.9,1.9,62.5,17,39,"",2400,75,2900,2,"",null,null,null,null,null,null,null,null,null,null,null,null,null,12.4,8.9,84,7.9,1.9,62.5,17,39,"",2400,75,2900,2]
[7,"24 Långgropen nedstr Eslöv","2021-06-21",16.3,5.7,58,7.72,2.6,70.8,70,100,"",1100,52,1600,"<2",""]
[7,"24 Långgropen nedstr Eslöv","2021-07-21",16,6.6,67,7.67,2.5,65.2,78,92,"",1100,49,1500,2.5,""]
[7,"24 Långgropen nedstr Eslöv","2021-08-30",14.7,8.1,80,7.83,7.3,53.5,"","","","","","","","Analys missad för närsalter och susp"]
[7,"24 Långgropen nedstr Eslöv","2021-09-29",12.8,8.6,82,7.77,6.5,55.4,99,130,"",4400,26,4800,3.1,""]
[7,"24 Långgropen nedstr Eslöv","2021-10-20",12.5,8,75,7.79,13,46.5,46,86,"",4300,77,5100,9.3000000000000007,""]
[7,"24 Långgropen nedstr Eslöv","2021-11-24",7.5,9.6999999999999993,81,7.92,2.8,62.5,34,39,"",7400,37,7600,"<2",""]
[7,"24 Långgropen nedstr Eslöv","2021-12-21",2.2000000000000002,11.6,84,7.73,6.8,55.4,25,49,"",5900,130,5600,5.5,"",null,null,null,null,null,null,null,null,null,null,null,null,null,2.2000000000000002,11.6,84,7.73,6.8,55.4,25,49,"",5900,130,5600,5.5]
[null,null,"Medel",5.5,11.899999999999999,93.833333333333329,7.8233333333333333,7.4333333333333336,54.9,null,55.333333333333336,{"$error":"#DIV/0!"},5016.666666666667,76.333333333333329,5416.666666666667,4.083333333333333,null,null,null,null,null,null,null,null,null,null,null,null,null,null,5.5,11.899999999999999,93.833333333333329,7.8233333333333333,7.4333333333333336,54.9,0,55.333333333333336,{"$error":"#DIV/0!"},5016.666666666667,76.333333333333329,5416.666666666667,4.083333333333333]
[null,null,"Max",12.4,13.4,108,8.0299999999999994,15,62.5,null,99,0,6900,130,7200,6.4,null,null,null,null,null,null,null,null,null,null,null,null,null,null,12.4,13.4,108,8.0299999999999994,15,62.5,0,99,0,6900,130,7200,6.4]
[null,null,"Min",2.2000000000000002,8.9,84,7.59,1.9,42.7,null,26,0,2400,47,2900,2,null,null,null,null,null,null,null,null,null,null,null,null,null,null,2.2000000000000002,8.9,84,7.59,1.9,42.7,0,26,0,2400,47,2900,2]
[null,null,null,null,null,null,null,null,null,null,null,null,null,null,null,null,null,null,null,null,null,null,null,null,null,null,null,null,null,null,0,0,0,0,0,0,0,0,0,0,0,0,0]
[8,"19 Saxån vid Annelöv","2021-02-22",3.2,13.2,99,7.97,17,44.7,65,110,"",6000,41,6300,15,"",null,null,null,null,null,null,null,null,null,null,null,null,null,3.2,13.2,99,7.97,17,44.7,65,110,"",6000,41,6300,15]
[8,"19 Saxån vid Annelöv","2021-03-24",5.9,12.4,100,8.2100000000000009,5.6,60,23,39,"",5900,16,6700,4.8,"",null,null,null,null,null,null,null,null,null,null,null,null,null,5.9,12.4,100,8.2100000000000009,5.6,60,23,39,"",5900,16,6700,4.8]
[8,"19 Saxån vid Annelöv","2021-05-25",12.9,8.1999999999999993,78,8.14,2,61.5,39,63,"",2700,60,3000,"<2","",null,null,null,null,null,null,null,null,null,null,null,null,null,12.9,8.1999999999999993,78,8.14,2,61.5,39,63,"",2700,60,3000,2]
[8,"19 Saxån vid Annelöv","2021-08-30",15.9,9.9,100,7.96,2.5,41,"","","","","","","","Analys missad för närsalter och susp",null,null,null,null,null,null,null,null,null,null,null,null,null,15.9,9.9,100,7.96,2.5,41,"","","","","","",""]
[8,"19 Saxån vid Annelöv","2021-10-20",11.5,8.8000000000000007,81,7.96,2.6,64.099999999999994,56,73,"",4900,"<10",6000,3.4,"",null,null,null,null,null,null,null,null,null,null,null,null,null,11.5,8.8000000000000007,81,7.96,2.6,64.099999999999994,56,73,"",4900,10,6000,3.4]
[8,"19 Saxån vid Annelöv","2021-12-21",2.6,12.8,94,8,7.8,56.3,39,65,"",6100,75,5900,7.3,"",null,null,null,null,null,null,null,null,null,null,null,null,null,2.6,12.8,94,8,7.8,56.3,39,65,"",6100,75,5900,7.3]
[null,null,"Medel",8.6666666666666661,10.883333333333333,92,8.0400000000000009,6.25,54.599999999999994,null,70,{"$error":"#DIV/0!"},5120,40.4,5580,6.5,null,null,null,null,null,null,null,null,null,null,null,null,null,null,8.6666666666666661,10.883333333333333,92,8.0400000000000009,6.25,54.599999999999994,0,70,{"$error":"#DIV/0!"},5120,40.4,5580,6.5]
[null,null,"Max",15.9,13.2,100,8.2100000000000009,17,64.099999999999994,null,110,0,6100,75,6700,15,null,null,null,null,null,null,null,null,null,null,null,null,null,null,15.9,13.2,100,8.2100000000000009,17,64.099999999999994,0,110,0,6100,75,6700,15]
[null,null,"Min",2.6,8.1999999999999993,78,7.96,2,41,null,39,0,2700,10,3000,2,null,null,null,null,null,null,null,null,null,null,null,null,null,null,2.6,8.1999999999999993,78,7.96,2,41,0,39,0,2700,10,3000,2]
[null,null,null,null,null,null,null,null,null,null,null,null,null,null,null,null,null,null,null,null,null,null,null,null,null,null,null,null,null,null,0,0,0,0,0,0,0,0,0,0,0,0,0]
[9,"30 Välabäcken","2021-01-25",4.0999999999999996,11.7,90,7.81,4.9000000000000004,76.099999999999994,40,89,26,15000,"<10",15000,4.2,"",null,null,null,null,null,null,null,null,null,null,null,null,null,4.0999999999999996,11.7,90,7.81,4.9000000000000004,76.099999999999994,40,89,26,15000,10,15000,4.2]
[9,"30 Välabäcken","2021-02-22",3.2,12.7,95,7.86,13,59.4,74,110,36,10000,15,11000,10,"",null,null,null,null,null,null,null,null,null,null,null,null,null,3.2,12.7,95,7.86,13,59.4,74,110,36,10000,15,11000,10]
[9,"30 Välabäcken","2021-03-24",6.4,13.9,113,8.23,1.6,76.400000000000006,14,37,20,12000,"<10",13000,"<2","",null,null,null,null,null,null,null,null,null,null,null,null,null,6.4,13.9,113,8.23,1.6,76.400000000000006,14,37,20,12000,10,13000,2]
[9,"30 Välabäcken","2021-04-27",5.6,13.1,104,7.99,1.6,79.099999999999994,4.4000000000000004,46,19,7200,69,8200,"<2","",null,null,null,null,null,null,null,null,null,null,null,null,null,5.6,13.1,104,7.99,1.6,79.099999999999994,4.4000000000000004,46,19,7200,69,8200,2]
[9,"30 Välabäcken","2021-05-25",11.6,10.7,99,8.1300000000000008,1.2,77.3,63,110,22,5100,46,5500,"<2","",null,null,null,null,null,null,null,null,null,null,null,null,null,11.6,10.7,99,8.1300000000000008,1.2,77.3,63,110,22,5100,46,5500,2]
[9,"30 Välabäcken","2021-06-21",15,7.2,72,7.84,1.2,79.400000000000006,140,210,60,4200,130,5300,7.8,"",null,null,null,null,null,null,null,null,null,null,null,null,null,15,7.2,72,7.84,1.2,79.400000000000006,140,210,60,4200,130,5300,7.8]
[9,"30 Välabäcken","2021-07-21",15.4,7.4,74,7.84,1.2,79.3,230,310,60,3000,140,4000,11,"",null,null,null,null,null,null,null,null,null,null,null,null,null,15.4,7.4,74,7.84,1.2,79.3,230,310,60,3000,140,4000,11]
[9,"30 Välabäcken","2021-08-30",15.2,9.6999999999999993,97,7.89,1.1000000000000001,74.400000000000006,"","","","","","","","Analys missad för närsalter och susp",null,null,null,null,null,null,null,null,null,null,null,null,null,15.2,9.6999999999999993,97,7.89,1.1000000000000001,74.400000000000006,"","","","","","",""]
[9,"30 Välabäcken","2021-09-29",12.2,9.6,90,7.8,1.8,76.2,130,140,10,4200,19,4600,"<2","",null,null,null,null,null,null,null,null,null,null,null,null,null,12.2,9.6,90,7.8,1.8,76.2,130,140,10,4200,19,4600,2]
[9,"30 Välabäcken","2021-10-20",12.6,8.3000000000000007,78,7.9,2.2999999999999998,81.3,71,87,11,8800,15,9900,3,"",null,null,null,null,null,null,null,null,null,null,null,null,null,12.6,8.3000000000000007,78,7.9,2.2999999999999998,81.3,71,87,11,8800,15,9900,3]
[9,"30 Välabäcken","2021-11-24",8.4,10,86,8.11,1,83.7,70,74,5,12000,34,12000,"<2","",null,null,null,null,null,null,null,null,null,null,null,null,null,8.4,10,86,8.11,1,83.7,70,74,5,12000,34,12000,2]
[9,"30 Välabäcken","2021-12-21",3.5,12.1,91,7.94,3.1,78.7,45,49,"<5,0",14000,60,13000,"<2","",null,null,null,null,null,null,null,null,null,null,null,null,null,3.5,12.1,91,7.94,3.1,78.7,45,49,5,14000,60,13000,2]
[null,null,"Medel",9.4333333333333336,10.533333333333333,90.75,7.9450000000000003,2.8333333333333335,76.775000000000006,null,114.72727272727273,24.90909090909091,8681.818181818182,49.81818181818182,9227.2727272727279,4.3636363636363633,null,null,null,null,null,null,null,null,null,null,null,null,null,null,9.4333333333333336,10.533333333333333,90.75,7.9450000000000003,2.8333333333333335,76.775000000000006,0,114.72727272727273,24.90909090909091,8681.818181818182,49.81818181818182,9227.2727272727279,4.3636363636363633]
[null,null,"Max",15.4,13.9,113,8.23,13,83.7,null,310,60,15000,140,15000,11,null,null,null,null,null,null,null,null,null,null,null,null,null,null,15.4,13.9,113,8.23,13,83.7,0,310,60,15000,140,15000,11]
[null,null,"Min",3.2,7.2,72,7.8,1,59.4,null,37,5,3000,10,4000,2,null,null,null,null,null,null,null,null,null,null,null,null,null,null,3.2,7.2,72,7.8,1,59.4,0,37,5,3000,10,4000,2]
[null,null,null,null,null,null,null,null,null,null,null,null,null,null,null,null,null,null,null,null,null,null,null,null,null,null,null,null,null,null,0,0,0,0,0,0,0,0,0,0,0,0,{"$f":"IF(OR(LEFT(P138,1)=\"<\",LEFT(P138,1)=\">\"),VALUE(MID(P138,2,5)),P138)","v":0}]
[10,"16 Saxån vid Saxtorp","2021-01-25",3.3,12.8,96,7.99,15,54.7,36,100,37,9200,"<10",9200,9.3000000000000007,"",null,null,null,null,null,null,null,null,null,null,null,null,null,3.3,12.8,96,7.99,15,54.7,36,100,37,9200,10,9200,9.3000000000000007]
[10,"16 Saxån vid Saxtorp","2021-02-22",3.1,12.8,95,7.96,19,44.9,80,130,49,6700,69,7100,13,"",null,null,null,null,null,null,null,null,null,null,null,null,null,3.1,12.8,95,7.96,19,44.9,80,130,49,6700,69,7100,13]
[10,"16 Saxån vid Saxtorp","2021-03-24",5.7,12.4,99,8.19,4.5999999999999996,65,29,48,17,7800,22,9000,3.2,"",null,null,null,null,null,null,null,null,null,null,null,null,null,5.7,12.4,99,8.19,4.5999999999999996,65,29,48,17,7800,22,9000,3.2]
[10,"16 Saxån vid Saxtorp","2021-04-27",7.6,11.6,97,8.02,2.4,64.599999999999994,24,43,16,4000,30,4800,"<2","",null,null,null,null,null,null,null,null,null,null,null,null,null,7.6,11.6,97,8.02,2.4,64.599999999999994,24,43,16,4000,30,4800,2]
[10,"16 Saxån vid Saxtorp","2021-05-25",12.5,8.9,84,8.16,1.9,66,55,77,15,3700,63,4000,"<2","",null,null,null,null,null,null,null,null,null,null,null,null,null,12.5,8.9,84,8.16,1.9,66,55,77,15,3700,63,4000,2]
[10,"16 Saxån vid Saxtorp","2021-06-21",18.8,6.1,66,7.92,1.2,70.5,170,190,20,2900,70,3600,"<2","",null,null,null,null,null,null,null,null,null,null,null,null,null,18.8,6.1,66,7.92,1.2,70.5,170,190,20,2900,70,3600,2]
[10,"16 Saxån vid Saxtorp","2021-07-21",18.2,7.2,76,7.96,1.8,62.4,170,200,10,2000,34,2700,"<2","",null,null,null,null,null,null,null,null,null,null,null,null,null,18.2,7.2,76,7.96,1.8,62.4,170,200,10,2000,34,2700,2]
[10,"16 Saxån vid Saxtorp","2021-08-30",16,11.3,115,8.1199999999999992,3.6,61.2,"","","","","","","","Analys missad för närsalter och susp",null,null,null,null,null,null,null,null,null,null,null,null,null,16,11.3,115,8.1199999999999992,3.6,61.2,"","","","","","",""]
[10,"16 Saxån vid Saxtorp","2021-09-29",13.7,9.3000000000000007,90,7.88,5.0999999999999996,66.7,110,130,20,3600,16,3800,2.8,"",null,null,null,null,null,null,null,null,null,null,null,null,null,13.7,9.3000000000000007,90,7.88,5.0999999999999996,66.7,110,130,20,3600,16,3800,2.8]
[10,"16 Saxån vid Saxtorp","2021-10-20",12.1,9.3000000000000007,87,8.02,4.5,67.900000000000006,69,95,21,6100,"<10",7100,3.8,"",null,null,null,null,null,null,null,null,null,null,null,null,null,12.1,9.3000000000000007,87,8.02,4.5,67.900000000000006,69,95,21,6100,10,7100,3.8]
[10,"16 Saxån vid Saxtorp","2021-11-24",7.1,10.8,89,8.23,3.5,67.5,59,64,11,8200,25,8600,2.7,"",null,null,null,null,null,null,null,null,null,null,null,null,null,7.1,10.8,89,8.23,3.5,67.5,59,64,11,8200,25,8600,2.7]
[10,"16 Saxån vid Saxtorp","2021-12-21",2.7,12.4,91,8.07,6.6,61.9,45,350,300,8200,73,7600,6.2,"",null,null,null,null,null,null,null,null,null,null,null,null,null,2.7,12.4,91,8.07,6.6,61.9,45,350,300,8200,73,7600,6.2]
[null,null,"Medel",10.066666666666666,10.408333333333333,90.416666666666671,8.0433333333333312,5.7666666666666666,62.774999999999999,null,129.72727272727272,46.909090909090907,5672.727272727273,38.363636363636367,6136.363636363636,4.4545454545454541,null,null,null,null,null,null,null,null,null,null,null,null,null,null,10.066666666666666,10.408333333333333,90.416666666666671,8.0433333333333312,5.7666666666666666,62.774999999999999,0,129.72727272727272,46.909090909090907,5672.727272727273,38.363636363636367,6136.363636363636,4.4545454545454541]
[null,null,"Max",18.8,12.8,115,8.23,19,70.5,null,350,300,9200,73,9200,13,null,null,null,null,null,null,null,null,null,null,null,null,null,null,18.8,12.8,115,8.23,19,70.5,0,350,300,9200,73,9200,13]
[null,null,"Min",2.7,6.1,66,7.88,1.2,44.9,null,43,10,2000,10,2700,2,null,null,null,null,null,null,null,null,null,null,null,null,null,null,2.7,6.1,66,7.88,1.2,44.9,0,43,10,2000,10,2700,2]

{"sheet":"Rapport","index":4,"n_rows":142,"n_cols":17,"rows_kept":142,"cut":false,"hidden":false,"merged":[]}
[null,"Saxån-Braån 2021\nRapport"]
[null,"Metoder och mätosäkerhet"]
[null,"Saxån-Braån 2021"]
[null,"Vattenkontroll "]
[null," På uppdrag av Saxån-Braåns vattenvårdskommitté"]
[]
["Sorterings-","Provtagningspunkt","Provtagn"," Temp"," Syreh","Syrem","  pH","Gruml","Kond","PO4-P","Tot-P","Part.-P"," NO3+2-N","NH4-N"," Tot-N","Susp","Anmärkning"]
["ordning","Nr Läge","datum","  °C","mg/l","%",null,"  FNU","mS/m"," µg/l"," µg/l","µg/l","  µg/l","  µg/l","  µg/l","mg/l"]
[250,"januari"]
[1,"14 Svalövsbäcken uppstr Svalöv","2021-01-25",3,12.7,94,7.55,9.5,39.299999999999997,21,48,16,8900,28,8800,3.4,"Resultatet av kväve total, N, är mindre än summanav ammoniumkväve, NH4-N, och nitrat + nitritkväve, NO23-N. Skillnaden ligger dock inommätosäkerheten."]
[2,"15:2 Svalövsbäcken nedstr Svalöv","2021-01-25",3.6,12.8,97,7.76,13,45.1,28,64,null,8700,290,8900,5.0999999999999996]
[3,"3:2 Örstorpsbäcken","2021-01-25",4.2,11.9,91,7.9,9.1,69,57,210,60,16000,35,17000,6.3]
[4,"5 Braån vid Asmundtorp","2021-01-25",3.3,12.6,94,7.92,14,49,42,81,30,8900,72,8900,7.2]
[6,"26 Långgropen uppstr Eslöv","2021-01-25",3.3,11.3,85,7.53,14,45.6,45,86,31,7100,65,7400,5.7]
[7,"24 Långgropen nedstr Eslöv","2021-01-25",3.6,11.7,88,7.59,14,47.2,46,84,null,6900,71,7200,5.8]
[9,"30 Välabäcken","2021-01-25",4.0999999999999996,11.7,90,7.81,4.9000000000000004,76.099999999999994,40,89,26,15000,"<10",15000,4.2]
[10,"16 Saxån vid Saxtorp","2021-01-25",3.3,12.8,96,7.99,15,54.7,36,100,37,9200,"<10",9200,9.3000000000000007]
[200,"provtagningsuppgifter",null,"Provtagning:Nina Svenbro    Analysansvarig Ekologigruppen:Jan Pröjts   Analysansvarig SYNLAB:Magnus Casselgren"]
[250,"februari"]
[1,"14 Svalövsbäcken uppstr Svalöv","2021-02-22",2.8,12.2,90,7.46,12,36.5,25,75,43,6500,11,7200,4]
[2,"15:2 Svalövsbäcken nedstr Svalöv","2021-02-22",3.2,12.9,96,7.69,14,39.9,32,81,null,6600,160,7500,6.8]
[3,"3:2 Örstorpsbäcken","2021-02-22",3.6,12.4,94,7.85,11,58.5,70,110,36,13000,"<10",13000,4.4000000000000004]
[4,"5 Braån vid Asmundtorp","2021-02-22",3.3,12.9,97,7.91,19,41.4,60,110,46,7400,64,7900,9.6]
[5,"28:2 Bäck N Trolleholm","2021-02-22",1.6,13.3,95,7.75,5.3,36.6,5,22,null,2300,52,2500,3]
[6,"26 Långgropen uppstr Eslöv","2021-02-22",2.9,12.5,93,7.64,16,40.700000000000003,55,98,36,6300,73,7000,3.9]
[7,"24 Långgropen nedstr Eslöv","2021-02-22",2.6,12.4,91,7.69,15,42.7,56,99,null,6000,83,6800,6.4]
[8,"19 Saxån vid Annelöv","2021-02-22",3.2,13.2,99,7.97,17,44.7,65,110,null,6000,41,6300,15]
[9,"30 Välabäcken","2021-02-22",3.2,12.7,95,7.86,13,59.4,74,110,36,10000,15,11000,10]
[10,"16 Saxån vid Saxtorp","2021-02-22",3.1,12.8,95,7.96,19,44.9,80,130,49,6700,69,7100,13]
[200,"provtagningsuppgifter",null,"Provtagning:Birgitta Bengtsson   Analysansvarig Ekologigruppen:Birgitta Bengtsson  Analysansvarig SYNLAB:Patric Eklundh"]
[250,"mars"]
[1,"14 Svalövsbäcken uppstr Svalöv","2021-03-24",5.5,12.6,100,7.96,4.0999999999999996,40.799999999999997,9.3000000000000007,22,9,5800,16,6700,2.2000000000000002]
[2,"15:2 Svalövsbäcken nedstr Svalöv","2021-03-24",6.5,12.8,104,8.0399999999999991,4.0999999999999996,48.8,16,32,null,6200,610,7400,3]
[3,"3:2 Örstorpsbäcken","2021-03-24",5.6,13.1,104,8.11,2.6,72.8,59,75,13,13000,10,15000,"<2"]
[4,"5 Braån vid Asmundtorp","2021-03-24",5.7,12.8,102,8.15,3.8,54.3,21,41,14,6800,48,7600,2.8]
[5,"28:2 Bäck N Trolleholm","2021-03-24",6.7,11.8,97,8.1,2.5,44.6,4.0999999999999996,10,null,1500,11,2200,2.2999999999999998]
[6,"26 Långgropen uppstr Eslöv","2021-03-24",6.4,13.9,113,8.08,4.5,57.4,15,36,19,6100,18,7000,2.6]
[7,"24 Långgropen nedstr Eslöv","2021-03-24",6.1,13.4,108,8.0299999999999994,4.2,60.1,17,35,null,6000,47,6500,2.8]
[8,"19 Saxån vid Annelöv","2021-03-24",5.9,12.4,100,8.2100000000000009,5.6,60,23,39,null,5900,16,6700,4.8]
[9,"30 Välabäcken","2021-03-24",6.4,13.9,113,8.23,1.6,76.400000000000006,14,37,20,12000,"<10",13000,"<2"]
[10,"16 Saxån vid Saxtorp","2021-03-24",5.7,12.4,99,8.19,4.5999999999999996,65,29,48,17,7800,22,9000,3.2]
[200,"provtagningsuppgifter",null,"Provtagning:Nina Svenbro    Analysansvarig Ekologigruppen:Jan Pröjts   Analysansvarig SYNLAB:Patric Eklundh"]
[250,"april"]
[1,"14 Svalövsbäcken uppstr Svalöv","2021-04-27",9.1,11.9,104,8.25,8,44.6,6.8,41,29,2200,39,3000,5.6]
[2,"15:2 Svalövsbäcken nedstr Svalöv","2021-04-27",6.6,14.8,121,8.1,3.7,54.2,7.8,27,null,3700,600,4900,"<2"]
[3,"3:2 Örstorpsbäcken","2021-04-27",5.5,11.4,91,8,3.8,70.900000000000006,88,120,31,6400,26,7300,3.3]
[4,"5 Braån vid Asmundtorp","2021-04-27",6.2,10.9,88,8.0299999999999994,2,57.7,14,30,10,3900,26,4600,"<2"]
[6,"26 Långgropen uppstr Eslöv","2021-04-27",6.1,17.100000000000001,138,8.26,1.8,60.3,2.7,18,12,3700,"<10",4300,"<2"]
[7,"24 Långgropen nedstr Eslöv","2021-04-27",6.1,13.4,108,8,2.7,61.5,9,26,null,2900,52,3500,"<2"]
[9,"30 Välabäcken","2021-04-27",5.6,13.1,104,7.99,1.6,79.099999999999994,4.4000000000000004,46,19,7200,69,8200,"<2"]
[10,"16 Saxån vid Saxtorp","2021-04-27",7.6,11.6,97,8.02,2.4,64.599999999999994,24,43,16,4000,30,4800,"<2"]
[200,"provtagningsuppgifter",null,"Provtagning:Nina Svenbro    Analysansvarig Ekologigruppen:Jan Pröjts   Analysansvarig SGS Analytics:Patric Eklundh"]
[250,"maj"]
[1,"14 Svalövsbäcken uppstr Svalöv","2021-05-25",14.4,8.3000000000000007,82,8.09,8.1999999999999993,46.9,12,56,31,2100,70,2700,9.6999999999999993]
[2,"15:2 Svalövsbäcken nedstr Svalöv","2021-05-25",12.4,9.6,90,8,1.8,56.4,14,39,null,4000,67,4400,"<2"]
[3,"3:2 Örstorpsbäcken","2021-05-25",11.6,8.5,78,8.02,2,72.099999999999994,110,140,20,6300,57,6600,2.4]
[4,"5 Braån vid Asmundtorp","2021-05-25",11.8,8.4,78,8.06,2.1,59.8,45,66,11,4100,47,4500,2.4]
[5,"28:2 Bäck N Trolleholm","2021-05-25",11.2,9.8000000000000007,90,8.1999999999999993,1.6,52.1,5,11,null,460,13,740,2.1]
[6,"26 Långgropen uppstr Eslöv","2021-05-25",12.6,9.9,93,8.02,1.8,62.5,11,33,17,2700,39,3200,2.4]
[7,"24 Långgropen nedstr Eslöv","2021-05-25",12.4,8.9,84,7.9,1.9,62.5,17,39,null,2400,75,2900,2]
[8,"19 Saxån vid Annelöv","2021-05-25",12.9,8.1999999999999993,78,8.14,2,61.5,39,63,null,2700,60,3000,"<2"]
[9,"30 Välabäcken","2021-05-25",11.6,10.7,99,8.1300000000000008,1.2,77.3,63,110,22,5100,46,5500,"<2"]
[10,"16 Saxån vid Saxtorp","2021-05-25",12.5,8.9,84,8.16,1.9,66,55,77,15,3700,63,4000,"<2"]
[200,"provtagningsuppgifter",null,"Provtagning:Nina Svenbro    Analysansvarig Ekologigruppen:Birgitta Bengtsson   Analysansvarig SGS Analytics:Patric Eklundh"]
[250,"juni"]
[1,"14 Svalövsbäcken uppstr Svalöv","2021-06-21",21.2,3.3,37,7.7,6.4,51.1,56,130,50,640,41,1800,6.5]
[2,"15:2 Svalövsbäcken nedstr Svalöv","2021-06-21",16.5,6.8,70,7.65,1.2,69.099999999999994,72,110,null,9500,110,10000,"<2"]
[3,"3:2 Örstorpsbäcken","2021-06-21",16.5,7,72,7.91,2.8,73.5,280,280,40,3800,64,4700,2.2000000000000002]
[4,"5 Braån vid Asmundtorp","2021-06-21",18.399999999999999,6.7,71,7.97,2.9,67.8,170,180,20,2900,51,3700,3]
[6,"26 Långgropen uppstr Eslöv","2021-06-21",16.3,5.9,60,7.73,2,66.400000000000006,68,94,29,1200,26,1800,"<2"]
[7,"24 Långgropen nedstr Eslöv","2021-06-21",16.3,5.7,58,7.72,2.6,70.8,70,100,null,1100,52,1600,"<2"]
[9,"30 Välabäcken","2021-06-21",15,7.2,72,7.84,1.2,79.400000000000006,140,210,60,4200,130,5300,7.8]
[10,"16 Saxån vid Saxtorp","2021-06-21",18.8,6.1,66,7.92,1.2,70.5,170,190,20,2900,70,3600,"<2"]
[200,"provtagningsuppgifter",null,"Provtagning:Nina Svenbro    Analysansvarig Ekologigruppen:Birgitta Bengtsson   Analysansvarig SGS Analytics:Patric Eklundh"]
[250,"juli"]
[1,"14 Svalövsbäcken uppstr Svalöv","2021-07-21",21.3,4.5,51,7.85,13.8,42.7,56,160,74,290,55,1700,11]
[2,"15:2 Svalövsbäcken nedstr Svalöv","2021-07-21",17.399999999999999,7.7,80,7.74,4.8,66.400000000000006,72,98,null,7200,110,7800,3.3]
[3,"3:2 Örstorpsbäcken","2021-07-21",15.9,8.3000000000000007,84,7.94,5.6,72.8,280,300,30,5200,35,5800,5.0999999999999996]
[4,"5 Braån vid Asmundtorp","2021-07-21",17.3,7.6,79,7.99,4.3,59.8,160,180,10,1900,27,2300,3.2]
[6,"26 Långgropen uppstr Eslöv","2021-07-21",16.100000000000001,7.3,74,7.7,1.9,62.4,77,90,16,1200,30,1800,"<2"]
[7,"24 Långgropen nedstr Eslöv","2021-07-21",16,6.6,67,7.67,2.5,65.2,78,92,null,1100,49,1500,2.5]
[9,"30 Välabäcken","2021-07-21",15.4,7.4,74,7.84,1.2,79.3,230,310,60,3000,140,4000,11]
[10,"16 Saxån vid Saxtorp","2021-07-21",18.2,7.2,76,7.96,1.8,62.4,170,200,10,2000,34,2700,"<2"]
[200,"provtagningsuppgifter",null,"Provtagning:Bengt Wedding    Analysansvarig Ekologigruppen:Bengt Wedding   Analysansvarig SGS Analytics:Patric Eklundh"]
[250,"augusti"]
[1,"14 Svalövsbäcken uppstr Svalöv","2021-08-30",16.8,11.3,117,8.5299999999999994,20,47.6,null,null,null,null,null,null,null,"Analys missad för närsalter och susp"]
[2,"15:2 Svalövsbäcken nedstr Svalöv","2021-08-30",16.2,9.6,98,8.02,7.1,55.8,null,null,null,null,null,null,null,"Analys missad för närsalter och susp"]
[3,"3:2 Örstorpsbäcken","2021-08-30",15.3,11.6,116,8,11,71.8,null,null,null,null,null,null,null,"Analys missad för närsalter och susp"]
[4,"5 Braån vid Asmundtorp","2021-08-30",16.399999999999999,11.7,120,8.08,4.5999999999999996,52.4,null,null,null,null,null,null,null,"Analys missad för närsalter och susp"]
[5,"28:2 Bäck N Trolleholm","2021-08-30",14.6,10.9,108,8.1300000000000008,5.3,50.2,null,null,null,null,null,null,null,"Analys missad för närsalter och susp"]
[6,"26 Långgropen uppstr Eslöv","2021-08-30",14.6,8.5,84,7.87,6.5,53.8,null,null,null,null,null,null,null,"Analys missad för närsalter och susp"]
[7,"24 Långgropen nedstr Eslöv","2021-08-30",14.7,8.1,80,7.83,7.3,53.5,null,null,null,null,null,null,null,"Analys missad för närsalter och susp"]
[8,"19 Saxån vid Annelöv","2021-08-30",15.9,9.9,100,7.96,2.5,41,null,null,null,null,null,null,null,"Analys missad för närsalter och susp"]
[9,"30 Välabäcken","2021-08-30",15.2,9.6999999999999993,97,7.89,1.1000000000000001,74.400000000000006,null,null,null,null,null,null,null,"Analys missad för närsalter och susp"]
[10,"16 Saxån vid Saxtorp","2021-08-30",16,11.3,115,8.1199999999999992,3.6,61.2,null,null,null,null,null,null,null,"Analys missad för närsalter och susp"]
[200,"provtagningsuppgifter",null,"Provtagning:Birgitta Bengtsson    Analysansvarig Ekologigruppen:Birgitta Bengtson"]
[250,"september"]
[1,"14 Svalövsbäcken uppstr Svalöv","2021-09-29",14.3,10.5,103,7.98,15,52.4,4.8,85,61,2200,41,2900,14]
[2,"15:2 Svalövsbäcken nedstr Svalöv","2021-09-29",13.5,10.3,99,7.97,13,55.9,33,110,null,4000,110,4500,12]
[3,"3:2 Örstorpsbäcken","2021-09-29",13.4,11,106,7.94,7.1,73.099999999999994,130,150,20,12000,24,11000,3.1]
[4,"5 Braån vid Asmundtorp","2021-09-29",13.9,10.6,103,7.97,21,47.5,230,280,60,5300,53,5600,11]
[6,"26 Långgropen uppstr Eslöv","2021-09-29",12.8,8.4,80,7.8,8,58.5,100,140,20,5900,18,6000,3.6]
[7,"24 Långgropen nedstr Eslöv","2021-09-29",12.8,8.6,82,7.77,6.5,55.4,99,130,null,4400,26,4800,3.1]
[9,"30 Välabäcken","2021-09-29",12.2,9.6,90,7.8,1.8,76.2,130,140,10,4200,19,4600,"<2"]
[10,"16 Saxån vid Saxtorp","2021-09-29",13.7,9.3000000000000007,90,7.88,5.0999999999999996,66.7,110,130,20,3600,16,3800,2.8]
[200,"provtagningsuppgifter",null,"Provtagning:Birgitta Bengtsson    Analysansvarig Ekologigruppen:Birgitta Bengtsson   Analysansvarig SGS Analytics:Patric Eklundh"]
[250,"oktober"]
[1,"14 Svalövsbäcken uppstr Svalöv","2021-10-20",11.2,9.5,87,7.67,10,51.4,17,57,32,6900,41,8200,12]
[2,"15:2 Svalövsbäcken nedstr Svalöv","2021-10-20",12.1,9.3000000000000007,87,7.75,55,52.4,30,220,null,7200,"<10",8700,86]
[3,"3:2 Örstorpsbäcken","2021-10-20",12.4,8.6,81,7.83,78,67.400000000000006,140,250,100,12000,16,14000,22]
[4,"5 Braån vid Asmundtorp","2021-10-20",12.1,9.3000000000000007,87,7.98,22,57.7,180,230,40,7500,15,8700,18]
[5,"28:2 Bäck N Trolleholm","2021-10-20",12.4,9.4,88,7.91,22,43.9,6.4,67,null,1600,"<10",2500,24]
[6,"26 Långgropen uppstr Eslöv","2021-10-20",12.3,8,75,7.79,40,55.2,65,140,68,6700,"<10",7900,20]
[7,"24 Långgropen nedstr Eslöv","2021-10-20",12.5,8,75,7.79,13,46.5,46,86,null,4300,77,5100,9.3000000000000007]
[8,"19 Saxån vid Annelöv","2021-10-20",11.5,8.8000000000000007,81,7.96,2.6,64.099999999999994,56,73,null,4900,"<10",6000,3.4]
[9,"30 Välabäcken","2021-10-20",12.6,8.3000000000000007,78,7.9,2.2999999999999998,81.3,71,87,11,8800,15,9900,3]
[10,"16 Saxån vid Saxtorp","2021-10-20",12.1,9.3000000000000007,87,8.02,4.5,67.900000000000006,69,95,21,6100,"<10",7100,3.8]
[200,"provtagningsuppgifter",null,"Provtagning:Birgitta Bengtsson    Analysansvarig Ekologigruppen:Birgitta Bengtsson   Analysansvarig SGS Analytics:Patric Eklund"]
[250,"november"]
[1,"14 Svalövsbäcken uppstr Svalöv","2021-11-24",6.7,10.5,86,8.39,4.5999999999999996,51.2,23,37,11,6200,53,6300,4.5]
[2,"15:2 Svalövsbäcken nedstr Svalöv","2021-11-24",7.7,11.5,97,8.0399999999999991,3.9,57.4,45,60,null,6600,350,7100,3.7]
[3,"3:2 Örstorpsbäcken","2021-11-24",8.1999999999999993,10.1,86,8.0399999999999991,2.7,79.099999999999994,120,110,10,13000,20,13000,2.2000000000000002]
[4,"5 Braån vid Asmundtorp","2021-11-24",7.4,10.6,88,8.18,4.2,61.4,84,86,8,8200,14,8200,2.7]
[6,"26 Långgropen uppstr Eslöv","2021-11-24",7.6,9.6999999999999993,81,7.94,2.8,61.8,33,40,11,7800,23,8100,2.6]
[7,"24 Långgropen nedstr Eslöv","2021-11-24",7.5,9.6999999999999993,81,7.92,2.8,62.5,34,39,null,7400,37,7600,"<2"]
[9,"30 Välabäcken","2021-11-24",8.4,10,86,8.11,1,83.7,70,74,5,12000,34,12000,"<2"]
[10,"16 Saxån vid Saxtorp","2021-11-24",7.1,10.8,89,8.23,3.5,67.5,59,64,11,8200,25,8600,2.7]
[200,"provtagningsuppgifter",null,"Provtagning:Birgitta Bengtsson  Analysansvarig Ekologigruppen:Birgitta Bengtsson  Analysansvarig SGS Analytics:Kristina Larsson"]
[250,"december"]
[1,"14 Svalövsbäcken uppstr Svalöv","2021-12-21",2.2000000000000002,12.5,91,7.7,5.0999999999999996,41.5,14,26,5,7100,42,7000,3.4]
[2,"15:2 Svalövsbäcken nedstr Svalöv","2021-12-21",2.5,12.8,94,7.8,5.4,47.8,23,36,null,7300,400,7200,3.5]
[3,"3:2 Örstorpsbäcken","2021-12-21",3.4,11.9,89,7.82,6.2,74.7,76,100,19,14000,48,13000,6.2]
[4,"5 Braån vid Asmundtorp","2021-12-21",2.8,12.6,93,8.01,6.6,52.5,60,87,14,7700,110,7200,5.7]
[5,"28:2 Bäck N Trolleholm","2021-12-21",0.3,13.7,94,7.97,2.8,38.200000000000003,3,12,null,1400,27,1700,"<2"]
[6,"26 Långgropen uppstr Eslöv","2021-12-21",2.5,11.4,84,7.7,6.6,53.7,24,39,8,6300,83,6300,4.5999999999999996]
[7,"24 Långgropen nedstr Eslöv","2021-12-21",2.2000000000000002,11.6,84,7.73,6.8,55.4,25,49,null,5900,130,5600,5.5]
[8,"19 Saxån vid Annelöv","2021-12-21",2.6,12.8,94,8,7.8,56.3,39,65,null,6100,75,5900,7.3]
[9,"30 Välabäcken","2021-12-21",3.5,12.1,91,7.94,3.1,78.7,45,49,"<5,0",14000,60,13000,"<2"]
[10,"16 Saxån vid Saxtorp","2021-12-21",2.7,12.4,91,8.07,6.6,61.9,45,350,300,8200,73,7600,6.2]
[200,"provtagningsuppgifter",null,"Provtagning:Birgitta Bengtsson  Analysansvarig Ekologigruppen:Birgitta Bengtsson  Analysansvarig SGS Analytics:Kristina Larsson"]
[null,""]
[null,""]

{"sheet":"Vattenföring","index":5,"n_rows":467,"n_cols":2,"rows_kept":467,"cut":false,"hidden":false,"merged":[]}
[]
["Saxån-Braån 2020"]
["Vattenföring "]
[]
[]
[]
[]
[]
[]
[]
[]
[]
[]
[]
[]
[]
[]
[]
[]
[]
[]
[]
[]
[]
[]
[]
[]
[]
[]
[]
[]
[]
[]
[]
[]
[]
[null,"Modellberäknad vattenföring för Saxåns myning"]
[null,"SMHI, S-Hype, delavrinningsområde 198"]
[null,"http://vattenweb.smhi.se/modelarea/basindownload/198"]
[]
[]
[]
[]
[]
[]
[]
[]
[]
[]
[]
[]
[]
[]
[]
[]
[]
[]
[]
[]
[]
[]
[]
[]
[]
[]
[]
[]
[]
[]
[]
[]
[]
[]
[]
[]
[]
[]
[]
[]
[]
[]
[]
[]
[]
[]
[]
[]
[]
[]
[]
[]
[]
[]
[]
[]
[]
[]
[]
["Data från SMHI S-Hype, delavrinningsområde 198"]
["Datum","S-hype, Saxåns mynning"]
["2021-01-01",10.7]
["2021-01-02",9.64]
["2021-01-03",8.08]
["2021-01-04",6.66]
["2021-01-05",5.52]
["2021-01-06",4.96]
["2021-01-07",5.5]
["2021-01-08",6.3]
["2021-01-09",6.49]
["2021-01-10",5.97]
["2021-01-11",8.36]
["2021-01-12",13]
["2021-01-13",14.3]
["2021-01-14",14.4]
["2021-01-15",12.2]
["2021-01-16",9.89]
["2021-01-17",8.02]
["2021-01-18",6.6]
["2021-01-19",6.71]
["2021-01-20",14.5]
["2021-01-21",21]
["2021-01-22",20]
["2021-01-23",16.100000000000001]
["2021-01-24",12.5]
["2021-01-25",10.1]
["2021-01-26",8.56]
["2021-01-27",7.53]
["2021-01-28",7.91]
["2021-01-29",7.19]
["2021-01-30",6.1]
["2021-01-31",5.0999999999999996]
["2021-02-01",4.37]
["2021-02-02",3.72]
["2021-02-03",3.15]
["2021-02-04",2.7]
["2021-02-05",2.31]
["2021-02-06",1.99]
["2021-02-07",1.73]
["2021-02-08",1.51]
["2021-02-09",1.32]
["2021-02-10",1.17]
["2021-02-11",1.04]
["2021-02-12",0.94599999999999995]
["2021-02-13",0.876]
["2021-02-14",0.81899999999999995]
["2021-02-15",0.77400000000000002]
["2021-02-16",0.81399999999999995]
["2021-02-17",2.84]
["2021-02-18",5.0199999999999996]
["2021-02-19",9.11]
["2021-02-20",13.4]
["2021-02-21",13.6]
["2021-02-22",11.5]
["2021-02-23",9.16]
["2021-02-24",7.17]
["2021-02-25",5.55]
["2021-02-26",4.26]
["2021-02-27",3.34]
["2021-02-28",2.68]
["2021-03-01",2.15]
["2021-03-02",1.75]
["2021-03-03",1.44]
["2021-03-04",1.22]
["2021-03-05",1.04]
["2021-03-06",0.92400000000000004]
["2021-03-07",0.83499999999999996]
["2021-03-08",0.76]
["2021-03-09",0.71099999999999997]
["2021-03-10",0.68500000000000005]
["2021-03-11",0.91400000000000003]
["2021-03-12",4.4400000000000004]
["2021-03-13",9.4499999999999993]
["2021-03-14",12.3]
["2021-03-15",12.1]
["2021-03-16",11.3]
["2021-03-17",9.42]
["2021-03-18",7.63]
["2021-03-19",6.19]
["2021-03-20",5.09]
["2021-03-21",4.21]
["2021-03-22",3.39]
["2021-03-23",2.7]
["2021-03-24",2.11]
["2021-03-25",1.57]
["2021-03-26",1.1599999999999999]
["2021-03-27",0.93600000000000005]
["2021-03-28",0.9]
["2021-03-29",1.8]
["2021-03-30",2.02]
["2021-03-31",1.66]
["2021-04-01",1.27]
["2021-04-02",1]
["2021-04-03",0.85799999999999998]
["2021-04-04",0.80500000000000005]
["2021-04-05",0.92]
["2021-04-06",1.18]
["2021-04-07",1.28]
["2021-04-08",1.1499999999999999]
["2021-04-09",1.01]
["2021-04-10",0.87]
["2021-04-11",0.96599999999999997]
["2021-04-12",3.25]
["2021-04-13",3.7]
["2021-04-14",3.17]
["2021-04-15",2.5099999999999998]
["2021-04-16",1.92]
["2021-04-17",1.44]
["2021-04-18",1.04]
["2021-04-19",0.80800000000000005]
["2021-04-20",0.68899999999999995]
["2021-04-21",0.629]
["2021-04-22",0.58099999999999996]
["2021-04-23",0.54200000000000004]
["2021-04-24",0.51]
["2021-04-25",0.48099999999999998]
["2021-04-26",0.45400000000000001]
["2021-04-27",0.42899999999999999]
["2021-04-28",0.40400000000000003]
["2021-04-29",0.38600000000000001]
["2021-04-30",0.36099999999999999]
["2021-05-01",0.34200000000000003]
["2021-05-02",0.32700000000000001]
["2021-05-03",0.31900000000000001]
["2021-05-04",0.66700000000000004]
["2021-05-05",0.86]
["2021-05-06",1.6]
["2021-05-07",2.2200000000000002]
["2021-05-08",2.97]
["2021-05-09",3.45]
["2021-05-10",2.92]
["2021-05-11",2.02]
["2021-05-12",1.31]
["2021-05-13",0.92]
["2021-05-14",0.74]
["2021-05-15",0.65300000000000002]
["2021-05-16",0.61499999999999999]
["2021-05-17",0.57899999999999996]
["2021-05-18",0.53900000000000003]
["2021-05-19",0.497]
["2021-05-20",0.46100000000000002]
["2021-05-21",0.43]
["2021-05-22",0.42799999999999999]
["2021-05-23",0.39600000000000002]
["2021-05-24",0.36899999999999999]
["2021-05-25",1.02]
["2021-05-26",0.97199999999999998]
["2021-05-27",0.88700000000000001]
["2021-05-28",0.82]
["2021-05-29",0.73599999999999999]
["2021-05-30",0.64900000000000002]
["2021-05-31",0.56899999999999995]
["2021-06-01",0.51200000000000001]
["2021-06-02",0.46899999999999997]
["2021-06-03",0.434]
["2021-06-04",0.40300000000000002]
["2021-06-05",0.374]
["2021-06-06",0.34699999999999998]
["2021-06-07",0.32400000000000001]
["2021-06-08",0.30599999999999999]
["2021-06-09",0.29199999999999998]
["2021-06-10",0.28100000000000003]
["2021-06-11",0.27300000000000002]
["2021-06-12",0.26700000000000002]
["2021-06-13",0.26100000000000001]
["2021-06-14",0.254]
["2021-06-15",0.248]
["2021-06-16",0.24199999999999999]
["2021-06-17",0.23300000000000001]
["2021-06-18",0.22500000000000001]
["2021-06-19",0.219]
["2021-06-20",0.215]
["2021-06-21",0.216]
["2021-06-22",0.21]
["2021-06-23",0.20499999999999999]
["2021-06-24",0.2]
["2021-06-25",0.19600000000000001]
["2021-06-26",0.191]
["2021-06-27",0.187]
["2021-06-28",0.182]
["2021-06-29",0.17899999999999999]
["2021-06-30",0.27900000000000003]
["2021-07-01",0.28299999999999997]
["2021-07-02",0.23200000000000001]
["2021-07-03",0.2]
["2021-07-04",0.18]
["2021-07-05",0.20599999999999999]
["2021-07-06",0.35199999999999998]
["2021-07-07",0.255]
["2021-07-08",0.19500000000000001]
["2021-07-09",1.97]
["2021-07-10",1.1399999999999999]
["2021-07-11",0.622]
["2021-07-12",0.45500000000000002]
["2021-07-13",0.39700000000000002]
["2021-07-14",0.36599999999999999]
["2021-07-15",0.34300000000000003]
["2021-07-16",0.38100000000000001]
["2021-07-17",0.33800000000000002]
["2021-07-18",0.313]
["2021-07-19",0.29899999999999999]
["2021-07-20",0.29099999999999998]
["2021-07-21",0.28199999999999997]
["2021-07-22",0.27400000000000002]
["2021-07-23",0.26700000000000002]
["2021-07-24",0.25900000000000001]
["2021-07-25",0.251]
["2021-07-26",0.246]
["2021-07-27",0.28100000000000003]
["2021-07-28",0.26]
["2021-07-29",0.316]
["2021-07-30",0.27300000000000002]
["2021-07-31",0.308]
["2021-08-01",0.26400000000000001]
["2021-08-02",0.254]
["2021-08-03",0.23699999999999999]
["2021-08-04",0.223]
["2021-08-05",0.214]
["2021-08-06",0.20699999999999999]
["2021-08-07",0.26100000000000001]
["2021-08-08",0.503]
["2021-08-09",0.39600000000000002]
["2021-08-10",0.45800000000000002]
["2021-08-11",0.434]
["2021-08-12",0.38900000000000001]
["2021-08-13",0.34]
["2021-08-14",0.317]
["2021-08-15",0.47]
["2021-08-16",1.1599999999999999]
["2021-08-17",7.94]
["2021-08-18",8.84]
["2021-08-19",6.58]
["2021-08-20",4.03]
["2021-08-21",2.5299999999999998]
["2021-08-22",1.74]
["2021-08-23",1.29]
["2021-08-24",1]
["2021-08-25",0.84099999999999997]
["2021-08-26",0.83799999999999997]
["2021-08-27",1.68]
["2021-08-28",2.4]
["2021-08-29",2.27]
["2021-08-30",1.74]
["2021-08-31",1.28]
["2021-09-01",0.997]
["2021-09-02",0.81499999999999995]
["2021-09-03",0.69199999999999995]
["2021-09-04",0.61399999999999999]
["2021-09-05",0.56000000000000005]
["2021-09-06",0.51800000000000002]
["2021-09-07",0.48]
["2021-09-08",0.44500000000000001]
["2021-09-09",0.41299999999999998]
["2021-09-10",0.38200000000000001]
["2021-09-11",0.375]
["2021-09-12",0.34200000000000003]
["2021-09-13",0.318]
["2021-09-14",0.30299999999999999]
["2021-09-15",1.48]
["2021-09-16",1.04]
["2021-09-17",0.77100000000000002]
["2021-09-18",0.68600000000000005]
["2021-09-19",0.629]
["2021-09-20",0.57599999999999996]
["2021-09-21",0.53900000000000003]
["2021-09-22",0.505]
["2021-09-23",0.54800000000000004]
["2021-09-24",0.58699999999999997]
["2021-09-25",0.56899999999999995]
["2021-09-26",0.52500000000000002]
["2021-09-27",1.46]
["2021-09-28",1.58]
["2021-09-29",3.47]
["2021-09-30",5.38]
["2021-10-01",6]
["2021-10-02",4.9800000000000004]
["2021-10-03",3.77]
["2021-10-04",2.81]
["2021-10-05",5.01]
["2021-10-06",8.83]
["2021-10-07",8.1999999999999993]
["2021-10-08",6.38]
["2021-10-09",4.84]
["2021-10-10",3.7]
["2021-10-11",2.93]
["2021-10-12",2.56]
["2021-10-13",2.15]
["2021-10-14",1.91]
["2021-10-15",2.76]
["2021-10-16",2.8]
["2021-10-17",2.34]
["2021-10-18",1.83]
["2021-10-19",1.89]
["2021-10-20",5.46]
["2021-10-21",15.8]
["2021-10-22",25.3]
["2021-10-23",24.1]
["2021-10-24",18.3]
["2021-10-25",13.4]
["2021-10-26",10.4]
["2021-10-27",8.57]
["2021-10-28",6.85]
["2021-10-29",5.32]
["2021-10-30",4.12]
["2021-10-31",3.22]
["2021-11-01",2.44]
["2021-11-02",1.82]
["2021-11-03",1.39]
["2021-11-04",1.1200000000000001]
["2021-11-05",0.96699999999999997]
["2021-11-06",0.98599999999999999]
["2021-11-07",2.23]
["2021-11-08",2.44]
["2021-11-09",2.13]
["2021-11-10",1.81]
["2021-11-11",1.56]
["2021-11-12",1.3]
["2021-11-13",1.1000000000000001]
["2021-11-14",0.95099999999999996]
["2021-11-15",0.84699999999999998]
["2021-11-16",0.77500000000000002]
["2021-11-17",0.746]
["2021-11-18",0.95699999999999996]
["2021-11-19",1.1599999999999999]
["2021-11-20",1.08]
["2021-11-21",0.91900000000000004]
["2021-11-22",0.81]
["2021-11-23",0.746]
["2021-11-24",0.70499999999999996]
["2021-11-25",0.84499999999999997]
["2021-11-26",2.17]
["2021-11-27",4.0599999999999996]
["2021-11-28",5.79]
["2021-11-29",7.73]
["2021-11-30",7.95]
["2021-12-01",12]
["2021-12-02",17.3]
["2021-12-03",17.100000000000001]
["2021-12-04",19.100000000000001]
["2021-12-05",19.5]
["2021-12-06",16.100000000000001]
["2021-12-07",12.8]
["2021-12-08",10.4]
["2021-12-09",8.85]
["2021-12-10",8.4499999999999993]
["2021-12-11",9.23]
["2021-12-12",9.64]
["2021-12-13",13.3]
["2021-12-14",18.399999999999999]
["2021-12-15",18.2]
["2021-12-16",14.7]
["2021-12-17",11.2]
["2021-12-18",8.6999999999999993]
["2021-12-19",6.8]
["2021-12-20",5.4]
["2021-12-21",4.42]
["2021-12-22",3.7]
["2021-12-23",3.84]
["2021-12-24",4.71]
["2021-12-25",4.4800000000000004]
["2021-12-26",3.87]
["2021-12-27",3.27]
["2021-12-28",2.78]
["2021-12-29",2.7]
["2021-12-30",4.03]
["2021-12-31",5.92]
[{"$f":"A465+1","v":"2022-01-01"}]
["2022-01-02"]

{"sheet":"Statistik","index":6,"n_rows":153,"n_cols":94,"rows_kept":153,"cut":false,"hidden":false,"merged":[]}
[null,"Saxån-Braån, Vattenkontroll - Statistik"]
[]
[null,{"$f":"CONCATENATE(\"Statistik för åren: \",MIN(R:R),\" - \",MAX(R:R))","v":"Statistik för åren: 2010 - 2020"}]
[null,"(kan vara annorlunda för vissa parametrar)"]
[]
[null,null,null,null,null,null,null,null,null,null,null,null,null,null,null,null,null,null,null,null,null,null,null,null,null,null,"Stödlinjer i diagram-->",null,null,null,null,null,null,null,null,null,null,null,null,null,null,null,null,null,null,null,null,null,null,null,null,null,null,null,null,null,null,null,null,null,null,null,null,null,null,null,null,null,null,null,null,null,null,null,null,null,null,null,null,null,null,"Värden omvandlade för statisitk -->"]
[null,null,null,"  °C","mg/l","%",null,"  FNU","mS/m"," µg/l"," µg/l"," µg/l","  µg/l","  µg/l","  µg/l","mg/l",null,null,null,null,null,null,null,null,null,null,"Syre",null,null,null,"pH",null,null,null,"Turb",null,null,null,"Kond",null,null,"PO4-P",null,null,"Tot_P",null,null,null,"Part-P",null,null,"NO2,3-N",null,null,"NH4-N",null,null,"Tot-N",null,null,null,"Susp",null,null,null,null,null,null,null,null,null,null,null,null,null,null,null,null,null,null,null,"  °C","mg/l","%",null,"  FNU","mS/m"," µg/l"," µg/l"," µg/l","  µg/l","  µg/l","  µg/l","mg/l"]
[null,{"$f":"INDEX(Provpunkter!B1:B10,Provpunkter!G1)","v":"15:2 Svalövsbäcken nedstr Svalöv"},"Datum"," Temp"," Syreh","Syrem","  pH","Gruml","Kond","PO4-P","Tot-P","Part.-P"," NO3+2-N","NH4-N"," Tot-N","Susp",null,"År","Månad",null,null,null,null,null,null,null,"Medel","+/- 1 std","- 1 std","Klass 4","Medel","+/- 1 std","- 1 std","Klass 3","Medel","+/- 1 std","- 1 std","Klass 5","Medel","+/- 1 std","- 1 std","Medel","+/- 1 std","- 1 std","Medel","+/- 1 std","- 1 std","Klass 5","Medel","+/- 1 std","- 1 std","Medel","+/- 1 std","- 1 std","Medel","+/- 1 std","- 1 std","Medel","+/- 1 std","- 1 std","Klass 5","Medel","+/- 1 std","- 1 std",null,null,"Test datum ",null,null,null,null,null,null,null,null,null,null,null,null,null,null," Temp"," Syrehalt","Syrem","  pH","Gruml","BOD7","Susp","PO4-P","Tot-P"," NO3+2-N","NH4-N"," Tot-N","Susp"]
[{"$f":"IF(B9=B$8,1,\"\")","v":""},null,null,null,null,null,null,null,null,null,null,null,null,null,null,null,null,null,null,null,null,null,null,null,null,null,{"$f":"$E$145","v":10.541590909090909},{"$f":"AA9+E$146","v":13.086650433746245},{"$f":"AA9-E$146","v":7.9965313844355723},2.95,{"$f":"$G$145","v":7.8355303030303025},{"$f":"AE9+G$146","v":8.0354704253415363},{"$f":"AE9-G$146","v":7.6355901807190687},6.5,{"$f":"$H$145","v":13.161742424242423},{"$f":"AI9+H$146","v":43.810002340134545},{"$f":"AI9-H$146","v":-17.4865174916497},7,{"$f":"$I$145","v":52.671969696969711},{"$f":"AM9+I$146","v":62.81683313153323},{"$f":"AM9-I$146","v":42.527106262406193},{"$f":"$J$145","v":53.603816793893131},{"$f":"AP9+J$146","v":125.17443861875186},{"$f":"AP9-J$146","v":-17.966805030965602},{"$f":"$K$145","v":95.717557251908403},{"$f":"AS9+$K$146","v":195.19505952555048},{"$f":"AS9-$K$146","v":-3.759945021733671},100,{"$f":"$L$145","v":23},{"$f":"AW9+$L$146","v":34.313708498984759},{"$f":"AW9-$L$146","v":11.686291501015239},{"$f":"$M$145","v":5893.5877862595416},{"$f":"AZ9+$M$146","v":8596.4199386799191},{"$f":"AZ9-$M$146","v":3190.7556338391637},{"$f":"$N$145","v":432.76335877862596},{"$f":"BC9+$N$146","v":1842.4404130773487},{"$f":"BC9-$N$146","v":-976.91369552009689},{"$f":"$O$145","v":6806.1068702290077},{"$f":"BF9+$O$146","v":9445.3595536514258},{"$f":"BF9-$O$146","v":4166.8541868065895},5000,{"$f":"$P$145","v":10.090076335877868},{"$f":"BJ9+$P$146","v":29.113660302029061},{"$f":"BJ9-$P$146","v":-8.9335076302733256},null,null,{"$f":"C9","v":0},null,null,null,null,null,null,null,null,null,null,null,null,null,null,{"$f":"IF(D9=\"\",\"\",IF(OR(LEFT(D9,1)=\"<\",LEFT(D9,1)=\">\"),VALUE(MID(D9,2,3)),D9))","v":""},{"$f":"IF(E9=\"\",\"\",IF(OR(LEFT(E9,1)=\"<\",LEFT(E9,1)=\">\"),VALUE(MID(E9,2,3)),E9))","v":""},{"$f":"IF(F9=\"\",\"\",IF(OR(LEFT(F9,1)=\"<\",LEFT(F9,1)=\">\"),VALUE(MID(F9,2,3)),F9))","v":""},{"$f":"IF(G9=\"\",\"\",IF(OR(LEFT(G9,1)=\"<\",LEFT(G9,1)=\">\"),VALUE(MID(G9,2,3)),G9))","v":""},{"$f":"IF(H9=\"\",\"\",IF(OR(LEFT(H9,1)=\"<\",LEFT(H9,1)=\">\"),VALUE(MID(H9,2,3)),H9))","v":""},{"$f":"IF(I9=\"\",\"\",IF(OR(LEFT(I9,1)=\"<\",LEFT(I9,1)=\">\"),VALUE(MID(I9,2,3)),I9))","v":""},{"$f":"IF(J9=\"\",\"\",IF(OR(LEFT(J9,1)=\"<\",LEFT(J9,1)=\">\"),VALUE(MID(J9,2,3)),J9))","v":""},{"$f":"IF(K9=\"\",\"\",IF(OR(LEFT(K9,1)=\"<\",LEFT(K9,1)=\">\"),VALUE(MID(K9,2,3)),K9))","v":""},{"$f":"IF(L9=\"\",\"\",IF(OR(LEFT(L9,1)=\"<\",LEFT(L9,1)=\">\"),VALUE(MID(L9,2,3)),L9))","v":""},{"$f":"IF(M9=\"\",\"\",IF(OR(LEFT(M9,1)=\"<\",LEFT(M9,1)=\">\"),VALUE(MID(M9,2,3)),M9))","v":""},{"$f":"IF(N9=\"\",\"\",IF(OR(LEFT(N9,1)=\"<\",LEFT(N9,1)=\">\"),VALUE(MID(N9,2,3)),N9))","v":""},{"$f":"IF(O9=\"\",\"\",IF(OR(LEFT(O9,1)=\"<\",LEFT(O9,1)=\">\"),VALUE(MID(O9,2,3)),O9))","v":""},{"$f":"IF(P9=\"\",\"\",IF(OR(LEFT(P9,1)=\"<\",LEFT(P9,1)=\">\"),VALUE(MID(P9,2,3)),P9))","v":""}]
[null,"15:2 Svalövsbäcken nedstr Svalöv","2010-01-26",-0.1,15.7,106.93145418055717,7.86,9.1999999999999993,62,40,51,null,4500,980,6200,"<5","fruset",2010,1,null,null,null,null,null,null,null,{"$f":"$E$145","v":10.541590909090909},{"$f":"AA10+E$146","v":13.086650433746245},{"$f":"AA10-E$146","v":7.9965313844355723},2.95,{"$f":"$G$145","v":7.8355303030303025},{"$f":"AE10+G$146","v":8.0354704253415363},{"$f":"AE10-G$146","v":7.6355901807190687},6.5,{"$f":"$H$145","v":13.161742424242423},{"$f":"AI10+H$146","v":43.810002340134545},{"$f":"AI10-H$146","v":-17.4865174916497},7,{"$f":"$I$145","v":52.671969696969711},{"$f":"AM10+I$146","v":62.81683313153323},{"$f":"AM10-I$146","v":42.527106262406193},{"$f":"$J$145","v":53.603816793893131},{"$f":"AP10+J$146","v":125.17443861875186},{"$f":"AP10-J$146","v":-17.966805030965602},{"$f":"$K$145","v":95.717557251908403},{"$f":"AS10+$K$146","v":195.19505952555048},{"$f":"AS10-$K$146","v":-3.759945021733671},100,{"$f":"$L$145","v":23},{"$f":"AW10+$L$146","v":34.313708498984759},{"$f":"AW10-$L$146","v":11.686291501015239},{"$f":"$M$145","v":5893.5877862595416},{"$f":"AZ10+$M$146","v":8596.4199386799191},{"$f":"AZ10-$M$146","v":3190.7556338391637},{"$f":"$N$145","v":432.76335877862596},{"$f":"BC10+$N$146","v":1842.4404130773487},{"$f":"BC10-$N$146","v":-976.91369552009689},{"$f":"$O$145","v":6806.1068702290077},{"$f":"BF10+$O$146","v":9445.3595536514258},{"$f":"BF10-$O$146","v":4166.8541868065895},5000,{"$f":"$P$145","v":10.090076335877868},{"$f":"BJ10+$P$146","v":29.113660302029061},{"$f":"BJ10-$P$146","v":-8.9335076302733256},null,null,{"$f":"C10","v":40204},null,null,null,null,null,null,null,null,null,null,null,null,null,null,{"$f":"IF(D10=\"\",\"\",IF(OR(LEFT(D10,1)=\"<\",LEFT(D10,1)=\">\"),VALUE(MID(D10,2,3)),D10))","v":-0.1},{"$f":"IF(E10=\"\",\"\",IF(OR(LEFT(E10,1)=\"<\",LEFT(E10,1)=\">\"),VALUE(MID(E10,2,3)),E10))","v":15.7},{"$f":"IF(F10=\"\",\"\",IF(OR(LEFT(F10,1)=\"<\",LEFT(F10,1)=\">\"),VALUE(MID(F10,2,3)),F10))","v":106.93145418055717},{"$f":"IF(G10=\"\",\"\",IF(OR(LEFT(G10,1)=\"<\",LEFT(G10,1)=\">\"),VALUE(MID(G10,2,3)),G10))","v":7.86},{"$f":"IF(H10=\"\",\"\",IF(OR(LEFT(H10,1)=\"<\",LEFT(H10,1)=\">\"),VALUE(MID(H10,2,3)),H10))","v":9.1999999999999993},{"$f":"IF(I10=\"\",\"\",IF(OR(LEFT(I10,1)=\"<\",LEFT(I10,1)=\">\"),VALUE(MID(I10,2,3)),I10))","v":62},{"$f":"IF(J10=\"\",\"\",IF(OR(LEFT(J10,1)=\"<\",LEFT(J10,1)=\">\"),VALUE(MID(J10,2,3)),J10))","v":40},{"$f":"IF(K10=\"\",\"\",IF(OR(LEFT(K10,1)=\"<\",LEFT(K10,1)=\">\"),VALUE(MID(K10,2,3)),K10))","v":51},{"$f":"IF(L10=\"\",\"\",IF(OR(LEFT(L10,1)=\"<\",LEFT(L10,1)=\">\"),VALUE(MID(L10,2,3)),L10))","v":""},{"$f":"IF(M10=\"\",\"\",IF(OR(LEFT(M10,1)=\"<\",LEFT(M10,1)=\">\"),VALUE(MID(M10,2,3)),M10))","v":4500},{"$f":"IF(N10=\"\",\"\",IF(OR(LEFT(N10,1)=\"<\",LEFT(N10,1)=\">\"),VALUE(MID(N10,2,3)),N10))","v":980},{"$f":"IF(O10=\"\",\"\",IF(OR(LEFT(O10,1)=\"<\",LEFT(O10,1)=\">\"),VALUE(MID(O10,2,3)),O10))","v":6200},{"$f":"IF(P10=\"\",\"\",IF(OR(LEFT(P10,1)=\"<\",LEFT(P10,1)=\">\"),VALUE(MID(P10,2,3)),P10))","v":5}]
[null,"15:2 Svalövsbäcken nedstr Svalöv","2010-02-22",0,14.9,101.77595628415301,7.99,9.75,68.8,28,50,null,4000,700,5200,7.4,null,2010,2,null,null,null,null,null,null,null,10.541590909090909,13.086650433746245,7.9965313844355723,2.95,7.8355303030303025,8.0354704253415363,7.6355901807190687,6.5,13.161742424242423,43.810002340134545,-17.4865174916497,7,52.671969696969711,62.81683313153323,42.527106262406193,53.603816793893131,125.17443861875186,-17.966805030965602,95.717557251908403,195.19505952555048,-3.759945021733671,100,23,34.313708498984759,11.686291501015239,5893.5877862595416,8596.4199386799191,3190.7556338391637,432.76335877862596,1842.4404130773487,-976.91369552009689,6806.1068702290077,9445.3595536514258,4166.8541868065895,5000,10.090076335877868,29.113660302029061,-8.9335076302733256,null,null,40231,null,null,null,null,null,null,null,null,null,null,null,null,null,null,0,14.9,101.77595628415301,7.99,9.75,68.8,28,50,"",4000,700,5200,7.4]
[null,"15:2 Svalövsbäcken nedstr Svalöv","2010-03-24",3.7,12.8,96.948698234368237,7.66,19,34,41,68,null,5700,60,6600,15,null,2010,3,null,null,null,null,null,null,null,10.541590909090909,13.086650433746245,7.9965313844355723,2.95,7.8355303030303025,8.0354704253415363,7.6355901807190687,6.5,13.161742424242423,43.810002340134545,-17.4865174916497,7,52.671969696969711,62.81683313153323,42.527106262406193,53.603816793893131,125.17443861875186,-17.966805030965602,95.717557251908403,195.19505952555048,-3.759945021733671,100,23,34.313708498984759,11.686291501015239,5893.5877862595416,8596.4199386799191,3190.7556338391637,432.76335877862596,1842.4404130773487,-976.91369552009689,6806.1068702290077,9445.3595536514258,4166.8541868065895,5000,10.090076335877868,29.113660302029061,-8.9335076302733256,null,null,40261,null,null,null,null,null,null,null,null,null,null,null,null,null,null,3.7,12.8,96.948698234368237,7.66,19,34,41,68,"",5700,60,6600,15]
[null,"15:2 Svalövsbäcken nedstr Svalöv","2010-04-27",8.8000000000000007,7.8,67.357685469313836,8,2.6,49.9,9,25,null,2800,370,4000,"<5",null,2010,4,null,null,null,null,null,null,null,10.541590909090909,13.086650433746245,7.9965313844355723,2.95,7.8355303030303025,8.0354704253415363,7.6355901807190687,6.5,13.161742424242423,43.810002340134545,-17.4865174916497,7,52.671969696969711,62.81683313153323,42.527106262406193,53.603816793893131,125.17443861875186,-17.966805030965602,95.717557251908403,195.19505952555048,-3.759945021733671,100,23,34.313708498984759,11.686291501015239,5893.5877862595416,8596.4199386799191,3190.7556338391637,432.76335877862596,1842.4404130773487,-976.91369552009689,6806.1068702290077,9445.3595536514258,4166.8541868065895,5000,10.090076335877868,29.113660302029061,-8.9335076302733256,null,null,40295,null,null,null,null,null,null,null,null,null,null,null,null,null,null,8.8000000000000007,7.8,67.357685469313836,8,2.6,49.9,9,25,"",2800,370,4000,5]
[null,"15:2 Svalövsbäcken nedstr Svalöv","2010-05-27",13.6,13.1,126.43340468964395,8.24,3.2,53.1,3,44,null,3200,210,4400,"<5",null,2010,5,null,null,null,null,null,null,null,10.541590909090909,13.086650433746245,7.9965313844355723,2.95,7.8355303030303025,8.0354704253415363,7.6355901807190687,6.5,13.161742424242423,43.810002340134545,-17.4865174916497,7,52.671969696969711,62.81683313153323,42.527106262406193,53.603816793893131,125.17443861875186,-17.966805030965602,95.717557251908403,195.19505952555048,-3.759945021733671,100,23,34.313708498984759,11.686291501015239,5893.5877862595416,8596.4199386799191,3190.7556338391637,432.76335877862596,1842.4404130773487,-976.91369552009689,6806.1068702290077,9445.3595536514258,4166.8541868065895,5000,10.090076335877868,29.113660302029061,-8.9335076302733256,null,null,40325,null,null,null,null,null,null,null,null,null,null,null,null,null,null,13.6,13.1,126.43340468964395,8.24,3.2,53.1,3,44,"",3200,210,4400,5]
[null,"15:2 Svalövsbäcken nedstr Svalöv","2010-06-23",16.5,8.73,89.593042448948495,8.09,5.9,55.2,11,62,null,3800,150,5100,9.1999999999999993,null,2010,6,null,null,null,null,null,null,null,10.541590909090909,13.086650433746245,7.9965313844355723,2.95,7.8355303030303025,8.0354704253415363,7.6355901807190687,6.5,13.161742424242423,43.810002340134545,-17.4865174916497,7,52.671969696969711,62.81683313153323,42.527106262406193,53.603816793893131,125.17443861875186,-17.966805030965602,95.717557251908403,195.19505952555048,-3.759945021733671,100,23,34.313708498984759,11.686291501015239,5893.5877862595416,8596.4199386799191,3190.7556338391637,432.76335877862596,1842.4404130773487,-976.91369552009689,6806.1068702290077,9445.3595536514258,4166.8541868065895,5000,10.090076335877868,29.113660302029061,-8.9335076302733256,null,null,40352,null,null,null,null,null,null,null,null,null,null,null,null,null,null,16.5,8.73,89.593042448948495,8.09,5.9,55.2,11,62,"",3800,150,5100,9.1999999999999993]
[null,"15:2 Svalövsbäcken nedstr Svalöv","2010-07-19",16.399999999999999,9.92,101.59758892313666,7.95,1.1000000000000001,66.900000000000006,49,68,null,7600,43,8200,"<5",null,2010,7,null,null,null,null,null,null,null,10.541590909090909,13.086650433746245,7.9965313844355723,2.95,7.8355303030303025,8.0354704253415363,7.6355901807190687,6.5,13.161742424242423,43.810002340134545,-17.4865174916497,7,52.671969696969711,62.81683313153323,42.527106262406193,53.603816793893131,125.17443861875186,-17.966805030965602,95.717557251908403,195.19505952555048,-3.759945021733671,100,23,34.313708498984759,11.686291501015239,5893.5877862595416,8596.4199386799191,3190.7556338391637,432.76335877862596,1842.4404130773487,-976.91369552009689,6806.1068702290077,9445.3595536514258,4166.8541868065895,5000,10.090076335877868,29.113660302029061,-8.9335076302733256,null,null,40378,null,null,null,null,null,null,null,null,null,null,null,null,null,null,16.399999999999999,9.92,101.59758892313666,7.95,1.1000000000000001,66.900000000000006,49,68,"",7600,43,8200,5]
[null,"15:2 Svalövsbäcken nedstr Svalöv","2010-08-25",20.100000000000001,11.6,127.70931007646409,8.16,5,45,16,68,null,3400,24,4200,5.7,null,2010,8,null,null,null,null,null,null,null,10.541590909090909,13.086650433746245,7.9965313844355723,2.95,7.8355303030303025,8.0354704253415363,7.6355901807190687,6.5,13.161742424242423,43.810002340134545,-17.4865174916497,7,52.671969696969711,62.81683313153323,42.527106262406193,53.603816793893131,125.17443861875186,-17.966805030965602,95.717557251908403,195.19505952555048,-3.759945021733671,100,23,34.313708498984759,11.686291501015239,5893.5877862595416,8596.4199386799191,3190.7556338391637,432.76335877862596,1842.4404130773487,-976.91369552009689,6806.1068702290077,9445.3595536514258,4166.8541868065895,5000,10.090076335877868,29.113660302029061,-8.9335076302733256,null,null,40415,null,null,null,null,null,null,null,null,null,null,null,null,null,null,20.100000000000001,11.6,127.70931007646409,8.16,5,45,16,68,"",3400,24,4200,5.7]
[null,"15:2 Svalövsbäcken nedstr Svalöv","2010-09-28",11,10.130000000000001,92.189677162344069,8.08,2.4,56.3,29,49,null,5100,21,6000,"<5",null,2010,9,null,null,null,null,null,null,null,10.541590909090909,13.086650433746245,7.9965313844355723,2.95,7.8355303030303025,8.0354704253415363,7.6355901807190687,6.5,13.161742424242423,43.810002340134545,-17.4865174916497,7,52.671969696969711,62.81683313153323,42.527106262406193,53.603816793893131,125.17443861875186,-17.966805030965602,95.717557251908403,195.19505952555048,-3.759945021733671,100,23,34.313708498984759,11.686291501015239,5893.5877862595416,8596.4199386799191,3190.7556338391637,432.76335877862596,1842.4404130773487,-976.91369552009689,6806.1068702290077,9445.3595536514258,4166.8541868065895,5000,10.090076335877868,29.113660302029061,-8.9335076302733256,null,null,40449,null,null,null,null,null,null,null,null,null,null,null,null,null,null,11,10.130000000000001,92.189677162344069,8.08,2.4,56.3,29,49,"",5100,21,6000,5]
[null,"15:2 Svalövsbäcken nedstr Svalöv","2010-10-26",7.5,10.7,89.475691770396622,7.5,52,44,67,120,null,9500,13,10000,20,null,2010,10,null,null,null,null,null,null,null,10.541590909090909,13.086650433746245,7.9965313844355723,2.95,7.8355303030303025,8.0354704253415363,7.6355901807190687,6.5,13.161742424242423,43.810002340134545,-17.4865174916497,7,52.671969696969711,62.81683313153323,42.527106262406193,53.603816793893131,125.17443861875186,-17.966805030965602,95.717557251908403,195.19505952555048,-3.759945021733671,100,23,34.313708498984759,11.686291501015239,5893.5877862595416,8596.4199386799191,3190.7556338391637,432.76335877862596,1842.4404130773487,-976.91369552009689,6806.1068702290077,9445.3595536514258,4166.8541868065895,5000,10.090076335877868,29.113660302029061,-8.9335076302733256,null,null,40477,null,null,null,null,null,null,null,null,null,null,null,null,null,null,7.5,10.7,89.475691770396622,7.5,52,44,67,120,"",9500,13,10000,20]
[null,"15:2 Svalövsbäcken nedstr Svalöv","2010-11-23",4.9000000000000004,11.4,89.15709964608827,7.5,146,40.9,92,260,null,6700,"<10",7700,61,null,2010,11,null,null,null,null,null,null,null,10.541590909090909,13.086650433746245,7.9965313844355723,2.95,7.8355303030303025,8.0354704253415363,7.6355901807190687,6.5,13.161742424242423,43.810002340134545,-17.4865174916497,7,52.671969696969711,62.81683313153323,42.527106262406193,53.603816793893131,125.17443861875186,-17.966805030965602,95.717557251908403,195.19505952555048,-3.759945021733671,100,23,34.313708498984759,11.686291501015239,5893.5877862595416,8596.4199386799191,3190.7556338391637,432.76335877862596,1842.4404130773487,-976.91369552009689,6806.1068702290077,9445.3595536514258,4166.8541868065895,5000,10.090076335877868,29.113660302029061,-8.9335076302733256,null,null,40505,null,null,null,null,null,null,null,null,null,null,null,null,null,null,4.9000000000000004,11.4,89.15709964608827,7.5,146,40.9,92,260,"",6700,10,7700,61]
[null,"15:2 Svalövsbäcken nedstr Svalöv","2010-12-21",0.1,14.8,101.38451967501308,7.82,7.5,53.3,29,42,null,4800,490,6000,"<5","istäckt",2010,12,null,null,null,null,null,null,null,10.541590909090909,13.086650433746245,7.9965313844355723,2.95,7.8355303030303025,8.0354704253415363,7.6355901807190687,6.5,13.161742424242423,43.810002340134545,-17.4865174916497,7,52.671969696969711,62.81683313153323,42.527106262406193,53.603816793893131,125.17443861875186,-17.966805030965602,95.717557251908403,195.19505952555048,-3.759945021733671,100,23,34.313708498984759,11.686291501015239,5893.5877862595416,8596.4199386799191,3190.7556338391637,432.76335877862596,1842.4404130773487,-976.91369552009689,6806.1068702290077,9445.3595536514258,4166.8541868065895,5000,10.090076335877868,29.113660302029061,-8.9335076302733256,null,null,40533,null,null,null,null,null,null,null,null,null,null,null,null,null,null,0.1,14.8,101.38451967501308,7.82,7.5,53.3,29,42,"",4800,490,6000,5]
[null,"15:2 Svalövsbäcken nedstr Svalöv","2011-01-27",1.4,13.6,96.676368714017556,7.58,21,39.1,41,58,null,4900,130,5600,"<5",null,2011,1,null,null,null,null,null,null,null,10.541590909090909,13.086650433746245,7.9965313844355723,2.95,7.8355303030303025,8.0354704253415363,7.6355901807190687,6.5,13.161742424242423,43.810002340134545,-17.4865174916497,7,52.671969696969711,62.81683313153323,42.527106262406193,53.603816793893131,125.17443861875186,-17.966805030965602,95.717557251908403,195.19505952555048,-3.759945021733671,100,23,34.313708498984759,11.686291501015239,5893.5877862595416,8596.4199386799191,3190.7556338391637,432.76335877862596,1842.4404130773487,-976.91369552009689,6806.1068702290077,9445.3595536514258,4166.8541868065895,5000,10.090076335877868,29.113660302029061,-8.9335076302733256,null,null,40570,null,null,null,null,null,null,null,null,null,null,null,null,null,null,1.4,13.6,96.676368714017556,7.58,21,39.1,41,58,"",4900,130,5600,5]
[null,"15:2 Svalövsbäcken nedstr Svalöv","2011-02-24",0.2,14,96.180467021504498,7.95,6.6,49.7,27,43,null,4600,600,6200,"<5",null,2011,2,null,null,null,null,null,null,null,10.541590909090909,13.086650433746245,7.9965313844355723,2.95,7.8355303030303025,8.0354704253415363,7.6355901807190687,6.5,13.161742424242423,43.810002340134545,-17.4865174916497,7,52.671969696969711,62.81683313153323,42.527106262406193,53.603816793893131,125.17443861875186,-17.966805030965602,95.717557251908403,195.19505952555048,-3.759945021733671,100,23,34.313708498984759,11.686291501015239,5893.5877862595416,8596.4199386799191,3190.7556338391637,432.76335877862596,1842.4404130773487,-976.91369552009689,6806.1068702290077,9445.3595536514258,4166.8541868065895,5000,10.090076335877868,29.113660302029061,-8.9335076302733256,null,null,40598,null,null,null,null,null,null,null,null,null,null,null,null,null,null,0.2,14,96.180467021504498,7.95,6.6,49.7,27,43,"",4600,600,6200,5]
[null,"15:2 Svalövsbäcken nedstr Svalöv","2011-03-29",5,15.3,119.97429403459358,8.3800000000000008,3.2,44.7,6,28,null,3600,210,4700,"<5",null,2011,3,null,null,null,null,null,null,null,10.541590909090909,13.086650433746245,7.9965313844355723,2.95,7.8355303030303025,8.0354704253415363,7.6355901807190687,6.5,13.161742424242423,43.810002340134545,-17.4865174916497,7,52.671969696969711,62.81683313153323,42.527106262406193,53.603816793893131,125.17443861875186,-17.966805030965602,95.717557251908403,195.19505952555048,-3.759945021733671,100,23,34.313708498984759,11.686291501015239,5893.5877862595416,8596.4199386799191,3190.7556338391637,432.76335877862596,1842.4404130773487,-976.91369552009689,6806.1068702290077,9445.3595536514258,4166.8541868065895,5000,10.090076335877868,29.113660302029061,-8.9335076302733256,null,null,40631,null,null,null,null,null,null,null,null,null,null,null,null,null,null,5,15.3,119.97429403459358,8.3800000000000008,3.2,44.7,6,28,"",3600,210,4700,5]
[null,"15:2 Svalövsbäcken nedstr Svalöv","2011-04-27",12.7,13.1,123.93702631314794,8.19,2.7,50.4,14,33,null,3000,230,3800,"<5",null,2011,4,null,null,null,null,null,null,null,10.541590909090909,13.086650433746245,7.9965313844355723,2.95,7.8355303030303025,8.0354704253415363,7.6355901807190687,6.5,13.161742424242423,43.810002340134545,-17.4865174916497,7,52.671969696969711,62.81683313153323,42.527106262406193,53.603816793893131,125.17443861875186,-17.966805030965602,95.717557251908403,195.19505952555048,-3.759945021733671,100,23,34.313708498984759,11.686291501015239,5893.5877862595416,8596.4199386799191,3190.7556338391637,432.76335877862596,1842.4404130773487,-976.91369552009689,6806.1068702290077,9445.3595536514258,4166.8541868065895,5000,10.090076335877868,29.113660302029061,-8.9335076302733256,null,null,40660,null,null,null,null,null,null,null,null,null,null,null,null,null,null,12.7,13.1,123.93702631314794,8.19,2.7,50.4,14,33,"",3000,230,3800,5]
[null,"15:2 Svalövsbäcken nedstr Svalöv","2011-05-24",12.7,8.4,79.471070307667375,7.8,9,54.2,44,75,null,3600,750,5300,"<5",null,2011,5,null,null,null,null,null,null,null,10.541590909090909,13.086650433746245,7.9965313844355723,2.95,7.8355303030303025,8.0354704253415363,7.6355901807190687,6.5,13.161742424242423,43.810002340134545,-17.4865174916497,7,52.671969696969711,62.81683313153323,42.527106262406193,53.603816793893131,125.17443861875186,-17.966805030965602,95.717557251908403,195.19505952555048,-3.759945021733671,100,23,34.313708498984759,11.686291501015239,5893.5877862595416,8596.4199386799191,3190.7556338391637,432.76335877862596,1842.4404130773487,-976.91369552009689,6806.1068702290077,9445.3595536514258,4166.8541868065895,5000,10.090076335877868,29.113660302029061,-8.9335076302733256,null,null,40687,null,null,null,null,null,null,null,null,null,null,null,null,null,null,12.7,8.4,79.471070307667375,7.8,9,54.2,44,75,"",3600,750,5300,5]
[null,"15:2 Svalövsbäcken nedstr Svalöv","2011-06-28",16.100000000000001,10.8,109.93023763426982,7.91,4.5999999999999996,54.6,13,41,null,3700,73,4700,"<5",null,2011,6,null,null,null,null,null,null,null,10.541590909090909,13.086650433746245,7.9965313844355723,2.95,7.8355303030303025,8.0354704253415363,7.6355901807190687,6.5,13.161742424242423,43.810002340134545,-17.4865174916497,7,52.671969696969711,62.81683313153323,42.527106262406193,53.603816793893131,125.17443861875186,-17.966805030965602,95.717557251908403,195.19505952555048,-3.759945021733671,100,23,34.313708498984759,11.686291501015239,5893.5877862595416,8596.4199386799191,3190.7556338391637,432.76335877862596,1842.4404130773487,-976.91369552009689,6806.1068702290077,9445.3595536514258,4166.8541868065895,5000,10.090076335877868,29.113660302029061,-8.9335076302733256,null,null,40722,null,null,null,null,null,null,null,null,null,null,null,null,null,null,16.100000000000001,10.8,109.93023763426982,7.91,4.5999999999999996,54.6,13,41,"",3700,73,4700,5]
[null,"15:2 Svalövsbäcken nedstr Svalöv","2011-07-27",16,9.6,97.514097877778909,7.93,6.9,45.5,42,96,null,2400,18,3400,5.4,null,2011,7,null,null,null,null,null,null,null,10.541590909090909,13.086650433746245,7.9965313844355723,2.95,7.8355303030303025,8.0354704253415363,7.6355901807190687,6.5,13.161742424242423,43.810002340134545,-17.4865174916497,7,52.671969696969711,62.81683313153323,42.527106262406193,53.603816793893131,125.17443861875186,-17.966805030965602,95.717557251908403,195.19505952555048,-3.759945021733671,100,23,34.313708498984759,11.686291501015239,5893.5877862595416,8596.4199386799191,3190.7556338391637,432.76335877862596,1842.4404130773487,-976.91369552009689,6806.1068702290077,9445.3595536514258,4166.8541868065895,5000,10.090076335877868,29.113660302029061,-8.9335076302733256,null,null,40751,null,null,null,null,null,null,null,null,null,null,null,null,null,null,16,9.6,97.514097877778909,7.93,6.9,45.5,42,96,"",2400,18,3400,5.4]
[null,"15:2 Svalövsbäcken nedstr Svalöv","2011-08-30",14.4,9.1999999999999993,90.349104214179661,7.8,12,47.7,19,84,null,4400,46,5400,9.1999999999999993,null,2011,8,null,null,null,null,null,null,null,10.541590909090909,13.086650433746245,7.9965313844355723,2.95,7.8355303030303025,8.0354704253415363,7.6355901807190687,6.5,13.161742424242423,43.810002340134545,-17.4865174916497,7,52.671969696969711,62.81683313153323,42.527106262406193,53.603816793893131,125.17443861875186,-17.966805030965602,95.717557251908403,195.19505952555048,-3.759945021733671,100,23,34.313708498984759,11.686291501015239,5893.5877862595416,8596.4199386799191,3190.7556338391637,432.76335877862596,1842.4404130773487,-976.91369552009689,6806.1068702290077,9445.3595536514258,4166.8541868065895,5000,10.090076335877868,29.113660302029061,-8.9335076302733256,null,null,40785,null,null,null,null,null,null,null,null,null,null,null,null,null,null,14.4,9.1999999999999993,90.349104214179661,7.8,12,47.7,19,84,"",4400,46,5400,9.1999999999999993]
[null,"15:2 Svalövsbäcken nedstr Svalöv","2011-09-27",12.6,8.5,80.237084119723704,7.96,2.9,51.3,31,37,null,3000,61,4000,"<5",null,2011,9,null,null,null,null,null,null,null,10.541590909090909,13.086650433746245,7.9965313844355723,2.95,7.8355303030303025,8.0354704253415363,7.6355901807190687,6.5,13.161742424242423,43.810002340134545,-17.4865174916497,7,52.671969696969711,62.81683313153323,42.527106262406193,53.603816793893131,125.17443861875186,-17.966805030965602,95.717557251908403,195.19505952555048,-3.759945021733671,100,23,34.313708498984759,11.686291501015239,5893.5877862595416,8596.4199386799191,3190.7556338391637,432.76335877862596,1842.4404130773487,-976.91369552009689,6806.1068702290077,9445.3595536514258,4166.8541868065895,5000,10.090076335877868,29.113660302029061,-8.9335076302733256,null,null,40813,null,null,null,null,null,null,null,null,null,null,null,null,null,null,12.6,8.5,80.237084119723704,7.96,2.9,51.3,31,37,"",3000,61,4000,5]
[null,"15:2 Svalövsbäcken nedstr Svalöv","2011-10-26",8.8000000000000007,10.5,90.673807362537843,7.91,4.7,51.6,30,44,null,4200,150,5000,"<5",null,2011,10,null,null,null,null,null,null,null,10.541590909090909,13.086650433746245,7.9965313844355723,2.95,7.8355303030303025,8.0354704253415363,7.6355901807190687,6.5,13.161742424242423,43.810002340134545,-17.4865174916497,7,52.671969696969711,62.81683313153323,42.527106262406193,53.603816793893131,125.17443861875186,-17.966805030965602,95.717557251908403,195.19505952555048,-3.759945021733671,100,23,34.313708498984759,11.686291501015239,5893.5877862595416,8596.4199386799191,3190.7556338391637,432.76335877862596,1842.4404130773487,-976.91369552009689,6806.1068702290077,9445.3595536514258,4166.8541868065895,5000,10.090076335877868,29.113660302029061,-8.9335076302733256,null,null,40842,null,null,null,null,null,null,null,null,null,null,null,null,null,null,8.8000000000000007,10.5,90.673807362537843,7.91,4.7,51.6,30,44,"",4200,150,5000,5]
[null,"15:2 Svalövsbäcken nedstr Svalöv","2011-11-29",5.4,11.6,91.921169654499906,7.99,9.1,49.9,35,59,null,3200,230,3900,7.2,null,2011,11,null,null,null,null,null,null,null,10.541590909090909,13.086650433746245,7.9965313844355723,2.95,7.8355303030303025,8.0354704253415363,7.6355901807190687,6.5,13.161742424242423,43.810002340134545,-17.4865174916497,7,52.671969696969711,62.81683313153323,42.527106262406193,53.603816793893131,125.17443861875186,-17.966805030965602,95.717557251908403,195.19505952555048,-3.759945021733671,100,23,34.313708498984759,11.686291501015239,5893.5877862595416,8596.4199386799191,3190.7556338391637,432.76335877862596,1842.4404130773487,-976.91369552009689,6806.1068702290077,9445.3595536514258,4166.8541868065895,5000,10.090076335877868,29.113660302029061,-8.9335076302733256,null,null,40876,null,null,null,null,null,null,null,null,null,null,null,null,null,null,5.4,11.6,91.921169654499906,7.99,9.1,49.9,35,59,"",3200,230,3900,7.2]
[null,"15:2 Svalövsbäcken nedstr Svalöv","2011-12-22",4.0999999999999996,12.2,93.404216320859888,7.87,8,48.2,28,45,null,5400,97,6000,"<5",null,2011,12,null,null,null,null,null,null,null,10.541590909090909,13.086650433746245,7.9965313844355723,2.95,7.8355303030303025,8.0354704253415363,7.6355901807190687,6.5,13.161742424242423,43.810002340134545,-17.4865174916497,7,52.671969696969711,62.81683313153323,42.527106262406193,53.603816793893131,125.17443861875186,-17.966805030965602,95.717557251908403,195.19505952555048,-3.759945021733671,100,23,34.313708498984759,11.686291501015239,5893.5877862595416,8596.4199386799191,3190.7556338391637,432.76335877862596,1842.4404130773487,-976.91369552009689,6806.1068702290077,9445.3595536514258,4166.8541868065895,5000,10.090076335877868,29.113660302029061,-8.9335076302733256,null,null,40899,null,null,null,null,null,null,null,null,null,null,null,null,null,null,4.0999999999999996,12.2,93.404216320859888,7.87,8,48.2,28,45,"",5400,97,6000,5]
[null,"15:2 Svalövsbäcken nedstr Svalöv","2012-01-27",2,13.3,96.145670787918704,7.81,10,49.6,22,46,null,4900,190,5900,8.9,null,2012,1,null,null,null,null,null,null,null,10.541590909090909,13.086650433746245,7.9965313844355723,2.95,7.8355303030303025,8.0354704253415363,7.6355901807190687,6.5,13.161742424242423,43.810002340134545,-17.4865174916497,7,52.671969696969711,62.81683313153323,42.527106262406193,53.603816793893131,125.17443861875186,-17.966805030965602,95.717557251908403,195.19505952555048,-3.759945021733671,100,23,34.313708498984759,11.686291501015239,5893.5877862595416,8596.4199386799191,3190.7556338391637,432.76335877862596,1842.4404130773487,-976.91369552009689,6806.1068702290077,9445.3595536514258,4166.8541868065895,5000,10.090076335877868,29.113660302029061,-8.9335076302733256,null,null,40935,null,null,null,null,null,null,null,null,null,null,null,null,null,null,2,13.3,96.145670787918704,7.81,10,49.6,22,46,"",4900,190,5900,8.9]
[null,"15:2 Svalövsbäcken nedstr Svalöv","2012-02-28",2.9,12.6,93.378955660141926,7.61,15,37.700000000000003,38,66,null,4000,180,5300,7,null,2012,2,null,null,null,null,null,null,null,10.541590909090909,13.086650433746245,7.9965313844355723,2.95,7.8355303030303025,8.0354704253415363,7.6355901807190687,6.5,13.161742424242423,43.810002340134545,-17.4865174916497,7,52.671969696969711,62.81683313153323,42.527106262406193,53.603816793893131,125.17443861875186,-17.966805030965602,95.717557251908403,195.19505952555048,-3.759945021733671,100,23,34.313708498984759,11.686291501015239,5893.5877862595416,8596.4199386799191,3190.7556338391637,432.76335877862596,1842.4404130773487,-976.91369552009689,6806.1068702290077,9445.3595536514258,4166.8541868065895,5000,10.090076335877868,29.113660302029061,-8.9335076302733256,null,null,40967,null,null,null,null,null,null,null,null,null,null,null,null,null,null,2.9,12.6,93.378955660141926,7.61,15,37.700000000000003,38,66,"",4000,180,5300,7]
[null,"15:2 Svalövsbäcken nedstr Svalöv","2012-03-29",6.9,13.2,108.72257535739377,8.2200000000000006,2.7,47.2,8,21,15,3200,28,4100,"<5",null,2012,3,null,null,null,null,null,null,null,10.541590909090909,13.086650433746245,7.9965313844355723,2.95,7.8355303030303025,8.0354704253415363,7.6355901807190687,6.5,13.161742424242423,43.810002340134545,-17.4865174916497,7,52.671969696969711,62.81683313153323,42.527106262406193,53.603816793893131,125.17443861875186,-17.966805030965602,95.717557251908403,195.19505952555048,-3.759945021733671,100,23,34.313708498984759,11.686291501015239,5893.5877862595416,8596.4199386799191,3190.7556338391637,432.76335877862596,1842.4404130773487,-976.91369552009689,6806.1068702290077,9445.3595536514258,4166.8541868065895,5000,10.090076335877868,29.113660302029061,-8.9335076302733256,null,null,40997,null,null,null,null,null,null,null,null,null,null,null,null,null,null,6.9,13.2,108.72257535739377,8.2200000000000006,2.7,47.2,8,21,15,3200,28,4100,5]
[null,"15:2 Svalövsbäcken nedstr Svalöv","2012-04-25",8.9,9.6999999999999993,83.969841833777537,7.86,2.7,48.9,4,24,null,2500,300,3500,"<5",null,2012,4,null,null,null,null,null,null,null,10.541590909090909,13.086650433746245,7.9965313844355723,2.95,7.8355303030303025,8.0354704253415363,7.6355901807190687,6.5,13.161742424242423,43.810002340134545,-17.4865174916497,7,52.671969696969711,62.81683313153323,42.527106262406193,53.603816793893131,125.17443861875186,-17.966805030965602,95.717557251908403,195.19505952555048,-3.759945021733671,100,23,34.313708498984759,11.686291501015239,5893.5877862595416,8596.4199386799191,3190.7556338391637,432.76335877862596,1842.4404130773487,-976.91369552009689,6806.1068702290077,9445.3595536514258,4166.8541868065895,5000,10.090076335877868,29.113660302029061,-8.9335076302733256,null,null,41024,null,null,null,null,null,null,null,null,null,null,null,null,null,null,8.9,9.6999999999999993,83.969841833777537,7.86,2.7,48.9,4,24,"",2500,300,3500,5]
[null,"15:2 Svalövsbäcken nedstr Svalöv","2012-05-29",13.1,7.8,74.455385473432727,7.93,3,60.8,5,49,null,3600,230,4500,"<5",null,2012,5,null,null,null,null,null,null,null,10.541590909090909,13.086650433746245,7.9965313844355723,2.95,7.8355303030303025,8.0354704253415363,7.6355901807190687,6.5,13.161742424242423,43.810002340134545,-17.4865174916497,7,52.671969696969711,62.81683313153323,42.527106262406193,53.603816793893131,125.17443861875186,-17.966805030965602,95.717557251908403,195.19505952555048,-3.759945021733671,100,23,34.313708498984759,11.686291501015239,5893.5877862595416,8596.4199386799191,3190.7556338391637,432.76335877862596,1842.4404130773487,-976.91369552009689,6806.1068702290077,9445.3595536514258,4166.8541868065895,5000,10.090076335877868,29.113660302029061,-8.9335076302733256,null,null,41058,null,null,null,null,null,null,null,null,null,null,null,null,null,null,13.1,7.8,74.455385473432727,7.93,3,60.8,5,49,"",3600,230,4500,5]
[null,"15:2 Svalövsbäcken nedstr Svalöv","2012-06-26",14.2,9.8000000000000007,95.827291369831826,7.91,7.8,49.7,25,74,null,2400,88,3300,"<5",null,2012,6,null,null,null,null,null,null,null,10.541590909090909,13.086650433746245,7.9965313844355723,2.95,7.8355303030303025,8.0354704253415363,7.6355901807190687,6.5,13.161742424242423,43.810002340134545,-17.4865174916497,7,52.671969696969711,62.81683313153323,42.527106262406193,53.603816793893131,125.17443861875186,-17.966805030965602,95.717557251908403,195.19505952555048,-3.759945021733671,100,23,34.313708498984759,11.686291501015239,5893.5877862595416,8596.4199386799191,3190.7556338391637,432.76335877862596,1842.4404130773487,-976.91369552009689,6806.1068702290077,9445.3595536514258,4166.8541868065895,5000,10.090076335877868,29.113660302029061,-8.9335076302733256,null,null,41086,null,null,null,null,null,null,null,null,null,null,null,null,null,null,14.2,9.8000000000000007,95.827291369831826,7.91,7.8,49.7,25,74,"",2400,88,3300,5]
[null,"15:2 Svalövsbäcken nedstr Svalöv","2012-07-25",16.2,9,91.797515020916336,7.88,2.1,59.8,20,46,null,6100,49,6200,"<5",null,2012,7,null,null,null,null,null,null,null,10.541590909090909,13.086650433746245,7.9965313844355723,2.95,7.8355303030303025,8.0354704253415363,7.6355901807190687,6.5,13.161742424242423,43.810002340134545,-17.4865174916497,7,52.671969696969711,62.81683313153323,42.527106262406193,53.603816793893131,125.17443861875186,-17.966805030965602,95.717557251908403,195.19505952555048,-3.759945021733671,100,23,34.313708498984759,11.686291501015239,5893.5877862595416,8596.4199386799191,3190.7556338391637,432.76335877862596,1842.4404130773487,-976.91369552009689,6806.1068702290077,9445.3595536514258,4166.8541868065895,5000,10.090076335877868,29.113660302029061,-8.9335076302733256,null,null,41115,null,null,null,null,null,null,null,null,null,null,null,null,null,null,16.2,9,91.797515020916336,7.88,2.1,59.8,20,46,"",6100,49,6200,5]
[null,"15:2 Svalövsbäcken nedstr Svalöv","2012-08-27",18.5,10.4,111.06906393601122,8.11,1.6,43.5,58,100,null,7100,520,8900,"<5",null,2012,8,null,null,null,null,null,null,null,10.541590909090909,13.086650433746245,7.9965313844355723,2.95,7.8355303030303025,8.0354704253415363,7.6355901807190687,6.5,13.161742424242423,43.810002340134545,-17.4865174916497,7,52.671969696969711,62.81683313153323,42.527106262406193,53.603816793893131,125.17443861875186,-17.966805030965602,95.717557251908403,195.19505952555048,-3.759945021733671,100,23,34.313708498984759,11.686291501015239,5893.5877862595416,8596.4199386799191,3190.7556338391637,432.76335877862596,1842.4404130773487,-976.91369552009689,6806.1068702290077,9445.3595536514258,4166.8541868065895,5000,10.090076335877868,29.113660302029061,-8.9335076302733256,null,null,41148,null,null,null,null,null,null,null,null,null,null,null,null,null,null,18.5,10.4,111.06906393601122,8.11,1.6,43.5,58,100,"",7100,520,8900,5]
[null,"15:2 Svalövsbäcken nedstr Svalöv","2012-09-24",11.9,10.199999999999999,94.771633764440097,8.01,3.5,51.7,22,62,null,3300,31,3800,"<5",null,2012,9,null,null,null,null,null,null,null,10.541590909090909,13.086650433746245,7.9965313844355723,2.95,7.8355303030303025,8.0354704253415363,7.6355901807190687,6.5,13.161742424242423,43.810002340134545,-17.4865174916497,7,52.671969696969711,62.81683313153323,42.527106262406193,53.603816793893131,125.17443861875186,-17.966805030965602,95.717557251908403,195.19505952555048,-3.759945021733671,100,23,34.313708498984759,11.686291501015239,5893.5877862595416,8596.4199386799191,3190.7556338391637,432.76335877862596,1842.4404130773487,-976.91369552009689,6806.1068702290077,9445.3595536514258,4166.8541868065895,5000,10.090076335877868,29.113660302029061,-8.9335076302733256,null,null,41176,null,null,null,null,null,null,null,null,null,null,null,null,null,null,11.9,10.199999999999999,94.771633764440097,8.01,3.5,51.7,22,62,"",3300,31,3800,5]
[null,"15:2 Svalövsbäcken nedstr Svalöv","2012-10-30",7,10.9,90.006479806144057,7.65,136,41.7,52,280,null,4700,"<10",6200,110,null,2012,10,null,null,null,null,null,null,null,10.541590909090909,13.086650433746245,7.9965313844355723,2.95,7.8355303030303025,8.0354704253415363,7.6355901807190687,6.5,13.161742424242423,43.810002340134545,-17.4865174916497,7,52.671969696969711,62.81683313153323,42.527106262406193,53.603816793893131,125.17443861875186,-17.966805030965602,95.717557251908403,195.19505952555048,-3.759945021733671,100,23,34.313708498984759,11.686291501015239,5893.5877862595416,8596.4199386799191,3190.7556338391637,432.76335877862596,1842.4404130773487,-976.91369552009689,6806.1068702290077,9445.3595536514258,4166.8541868065895,5000,10.090076335877868,29.113660302029061,-8.9335076302733256,null,null,41212,null,null,null,null,null,null,null,null,null,null,null,null,null,null,7,10.9,90.006479806144057,7.65,136,41.7,52,280,"",4700,10,6200,110]
[null,"15:2 Svalövsbäcken nedstr Svalöv","2012-11-25",5.5,12.7,100.90111482896506,7.41,75,34,93,240,null,7900,15,8300,47,null,2012,11,null,null,null,null,null,null,null,10.541590909090909,13.086650433746245,7.9965313844355723,2.95,7.8355303030303025,8.0354704253415363,7.6355901807190687,6.5,13.161742424242423,43.810002340134545,-17.4865174916497,7,52.671969696969711,62.81683313153323,42.527106262406193,53.603816793893131,125.17443861875186,-17.966805030965602,95.717557251908403,195.19505952555048,-3.759945021733671,100,23,34.313708498984759,11.686291501015239,5893.5877862595416,8596.4199386799191,3190.7556338391637,432.76335877862596,1842.4404130773487,-976.91369552009689,6806.1068702290077,9445.3595536514258,4166.8541868065895,5000,10.090076335877868,29.113660302029061,-8.9335076302733256,null,null,41238,null,null,null,null,null,null,null,null,null,null,null,null,null,null,5.5,12.7,100.90111482896506,7.41,75,34,93,240,"",7900,15,8300,47]
[null,"15:2 Svalövsbäcken nedstr Svalöv","2012-11-28",6.8,12.8,105.16036089903622,7.65,24,43.8,37,56,null,6800,32,7300,11,null,2012,11,null,null,null,null,null,null,null,10.541590909090909,13.086650433746245,7.9965313844355723,2.95,7.8355303030303025,8.0354704253415363,7.6355901807190687,6.5,13.161742424242423,43.810002340134545,-17.4865174916497,7,52.671969696969711,62.81683313153323,42.527106262406193,53.603816793893131,125.17443861875186,-17.966805030965602,95.717557251908403,195.19505952555048,-3.759945021733671,100,23,34.313708498984759,11.686291501015239,5893.5877862595416,8596.4199386799191,3190.7556338391637,432.76335877862596,1842.4404130773487,-976.91369552009689,6806.1068702290077,9445.3595536514258,4166.8541868065895,5000,10.090076335877868,29.113660302029061,-8.9335076302733256,null,null,41241,null,null,null,null,null,null,null,null,null,null,null,null,null,null,6.8,12.8,105.16036089903622,7.65,24,43.8,37,56,"",6800,32,7300,11]
[null,"15:2 Svalövsbäcken nedstr Svalöv","2012-12-20",3.1,13.6,101.3430003484672,7.48,14,45.3,28,59,null,7100,72,7800,8.9,null,2012,12,null,null,null,null,null,null,null,10.541590909090909,13.086650433746245,7.9965313844355723,2.95,7.8355303030303025,8.0354704253415363,7.6355901807190687,6.5,13.161742424242423,43.810002340134545,-17.4865174916497,7,52.671969696969711,62.81683313153323,42.527106262406193,53.603816793893131,125.17443861875186,-17.966805030965602,95.717557251908403,195.19505952555048,-3.759945021733671,100,23,34.313708498984759,11.686291501015239,5893.5877862595416,8596.4199386799191,3190.7556338391637,432.76335877862596,1842.4404130773487,-976.91369552009689,6806.1068702290077,9445.3595536514258,4166.8541868065895,5000,10.090076335877868,29.113660302029061,-8.9335076302733256,null,null,41263,null,null,null,null,null,null,null,null,null,null,null,null,null,null,3.1,13.6,101.3430003484672,7.48,14,45.3,28,59,"",7100,72,7800,8.9]
[null,"15:2 Svalövsbäcken nedstr Svalöv","2013-01-30",2.7,12.8,94.341639068769254,7.6,131,29.6,180,310,null,2900,210,4000,110,null,2013,1,null,null,null,null,null,null,null,10.541590909090909,13.086650433746245,7.9965313844355723,2.95,7.8355303030303025,8.0354704253415363,7.6355901807190687,6.5,13.161742424242423,43.810002340134545,-17.4865174916497,7,52.671969696969711,62.81683313153323,42.527106262406193,53.603816793893131,125.17443861875186,-17.966805030965602,95.717557251908403,195.19505952555048,-3.759945021733671,100,23,34.313708498984759,11.686291501015239,5893.5877862595416,8596.4199386799191,3190.7556338391637,432.76335877862596,1842.4404130773487,-976.91369552009689,6806.1068702290077,9445.3595536514258,4166.8541868065895,5000,10.090076335877868,29.113660302029061,-8.9335076302733256,null,null,41304,null,null,null,null,null,null,null,null,null,null,null,null,null,null,2.7,12.8,94.341639068769254,7.6,131,29.6,180,310,"",2900,210,4000,110]
[null,"15:2 Svalövsbäcken nedstr Svalöv","2013-02-26",2.2999999999999998,13.5,98.408209149014354,7.92,2.2999999999999998,47.9,7,28,null,4700,210,5300,"<5",null,2013,2,null,null,null,null,null,null,null,10.541590909090909,13.086650433746245,7.9965313844355723,2.95,7.8355303030303025,8.0354704253415363,7.6355901807190687,6.5,13.161742424242423,43.810002340134545,-17.4865174916497,7,52.671969696969711,62.81683313153323,42.527106262406193,53.603816793893131,125.17443861875186,-17.966805030965602,95.717557251908403,195.19505952555048,-3.759945021733671,100,23,34.313708498984759,11.686291501015239,5893.5877862595416,8596.4199386799191,3190.7556338391637,432.76335877862596,1842.4404130773487,-976.91369552009689,6806.1068702290077,9445.3595536514258,4166.8541868065895,5000,10.090076335877868,29.113660302029061,-8.9335076302733256,null,null,41331,null,null,null,null,null,null,null,null,null,null,null,null,null,null,2.2999999999999998,13.5,98.408209149014354,7.92,2.2999999999999998,47.9,7,28,"",4700,210,5300,5]
[null,"15:2 Svalövsbäcken nedstr Svalöv","2013-03-26",0.5,14,97.011008711734831,7.96,2.5,53.5,9,21,null,4700,840,5600,"<5",null,2013,3,null,null,null,null,null,null,null,10.541590909090909,13.086650433746245,7.9965313844355723,2.95,7.8355303030303025,8.0354704253415363,7.6355901807190687,6.5,13.161742424242423,43.810002340134545,-17.4865174916497,7,52.671969696969711,62.81683313153323,42.527106262406193,53.603816793893131,125.17443861875186,-17.966805030965602,95.717557251908403,195.19505952555048,-3.759945021733671,100,23,34.313708498984759,11.686291501015239,5893.5877862595416,8596.4199386799191,3190.7556338391637,432.76335877862596,1842.4404130773487,-976.91369552009689,6806.1068702290077,9445.3595536514258,4166.8541868065895,5000,10.090076335877868,29.113660302029061,-8.9335076302733256,null,null,41359,null,null,null,null,null,null,null,null,null,null,null,null,null,null,0.5,14,97.011008711734831,7.96,2.5,53.5,9,21,"",4700,840,5600,5]
[null,"15:2 Svalövsbäcken nedstr Svalöv","2013-04-25",8.5,12.2,104.58316876325226,8.01,3.6,43.9,6,27,null,2800,280,3500,"<5",null,2013,4,null,null,null,null,null,null,null,10.541590909090909,13.086650433746245,7.9965313844355723,2.95,7.8355303030303025,8.0354704253415363,7.6355901807190687,6.5,13.161742424242423,43.810002340134545,-17.4865174916497,7,52.671969696969711,62.81683313153323,42.527106262406193,53.603816793893131,125.17443861875186,-17.966805030965602,95.717557251908403,195.19505952555048,-3.759945021733671,100,23,34.313708498984759,11.686291501015239,5893.5877862595416,8596.4199386799191,3190.7556338391637,432.76335877862596,1842.4404130773487,-976.91369552009689,6806.1068702290077,9445.3595536514258,4166.8541868065895,5000,10.090076335877868,29.113660302029061,-8.9335076302733256,null,null,41389,null,null,null,null,null,null,null,null,null,null,null,null,null,null,8.5,12.2,104.58316876325226,8.01,3.6,43.9,6,27,"",2800,280,3500,5]
[null,"15:2 Svalövsbäcken nedstr Svalöv","2013-05-29",12.2,9,84.194154862734322,7.77,3.7,64.3,35,62,null,6500,320,7500,"<5",null,2013,5,null,null,null,null,null,null,null,10.541590909090909,13.086650433746245,7.9965313844355723,2.95,7.8355303030303025,8.0354704253415363,7.6355901807190687,6.5,13.161742424242423,43.810002340134545,-17.4865174916497,7,52.671969696969711,62.81683313153323,42.527106262406193,53.603816793893131,125.17443861875186,-17.966805030965602,95.717557251908403,195.19505952555048,-3.759945021733671,100,23,34.313708498984759,11.686291501015239,5893.5877862595416,8596.4199386799191,3190.7556338391637,432.76335877862596,1842.4404130773487,-976.91369552009689,6806.1068702290077,9445.3595536514258,4166.8541868065895,5000,10.090076335877868,29.113660302029061,-8.9335076302733256,null,null,41423,null,null,null,null,null,null,null,null,null,null,null,null,null,null,12.2,9,84.194154862734322,7.77,3.7,64.3,35,62,"",6500,320,7500,5]
[null,"15:2 Svalövsbäcken nedstr Svalöv","2013-06-26",14.4,8.6999999999999993,85.438826811235131,7.85,1.9,51.1,16,39,null,6200,73,6900,"<5",null,2013,6,null,null,null,null,null,null,null,10.541590909090909,13.086650433746245,7.9965313844355723,2.95,7.8355303030303025,8.0354704253415363,7.6355901807190687,6.5,13.161742424242423,43.810002340134545,-17.4865174916497,7,52.671969696969711,62.81683313153323,42.527106262406193,53.603816793893131,125.17443861875186,-17.966805030965602,95.717557251908403,195.19505952555048,-3.759945021733671,100,23,34.313708498984759,11.686291501015239,5893.5877862595416,8596.4199386799191,3190.7556338391637,432.76335877862596,1842.4404130773487,-976.91369552009689,6806.1068702290077,9445.3595536514258,4166.8541868065895,5000,10.090076335877868,29.113660302029061,-8.9335076302733256,null,null,41451,null,null,null,null,null,null,null,null,null,null,null,null,null,null,14.4,8.6999999999999993,85.438826811235131,7.85,1.9,51.1,16,39,"",6200,73,6900,5]
[null,"15:2 Svalövsbäcken nedstr Svalöv","2013-07-25",15.9,9.5,96.298674411922107,7.88,1.1000000000000001,63.6,17,35,null,8500,43,8900,"<5",null,2013,7,null,null,null,null,null,null,null,10.541590909090909,13.086650433746245,7.9965313844355723,2.95,7.8355303030303025,8.0354704253415363,7.6355901807190687,6.5,13.161742424242423,43.810002340134545,-17.4865174916497,7,52.671969696969711,62.81683313153323,42.527106262406193,53.603816793893131,125.17443861875186,-17.966805030965602,95.717557251908403,195.19505952555048,-3.759945021733671,100,23,34.313708498984759,11.686291501015239,5893.5877862595416,8596.4199386799191,3190.7556338391637,432.76335877862596,1842.4404130773487,-976.91369552009689,6806.1068702290077,9445.3595536514258,4166.8541868065895,5000,10.090076335877868,29.113660302029061,-8.9335076302733256,null,null,41480,null,null,null,null,null,null,null,null,null,null,null,null,null,null,15.9,9.5,96.298674411922107,7.88,1.1000000000000001,63.6,17,35,"",8500,43,8900,5]
[null,"15:2 Svalövsbäcken nedstr Svalöv","2013-08-27",14.4,9,88.384993253001852,7.8,1.7,60.7,66,100,null,7600,36,8300,"<5",null,2013,8,null,null,null,null,null,null,null,10.541590909090909,13.086650433746245,7.9965313844355723,2.95,7.8355303030303025,8.0354704253415363,7.6355901807190687,6.5,13.161742424242423,43.810002340134545,-17.4865174916497,7,52.671969696969711,62.81683313153323,42.527106262406193,53.603816793893131,125.17443861875186,-17.966805030965602,95.717557251908403,195.19505952555048,-3.759945021733671,100,23,34.313708498984759,11.686291501015239,5893.5877862595416,8596.4199386799191,3190.7556338391637,432.76335877862596,1842.4404130773487,-976.91369552009689,6806.1068702290077,9445.3595536514258,4166.8541868065895,5000,10.090076335877868,29.113660302029061,-8.9335076302733256,null,null,41513,null,null,null,null,null,null,null,null,null,null,null,null,null,null,14.4,9,88.384993253001852,7.8,1.7,60.7,66,100,"",7600,36,8300,5]
[null,"15:2 Svalövsbäcken nedstr Svalöv","2013-09-26",9.9,10.3,91.338925749115631,7.87,0.89,60.3,22,42,null,7200,23,7900,"<5",null,2013,9,null,null,null,null,null,null,null,10.541590909090909,13.086650433746245,7.9965313844355723,2.95,7.8355303030303025,8.0354704253415363,7.6355901807190687,6.5,13.161742424242423,43.810002340134545,-17.4865174916497,7,52.671969696969711,62.81683313153323,42.527106262406193,53.603816793893131,125.17443861875186,-17.966805030965602,95.717557251908403,195.19505952555048,-3.759945021733671,100,23,34.313708498984759,11.686291501015239,5893.5877862595416,8596.4199386799191,3190.7556338391637,432.76335877862596,1842.4404130773487,-976.91369552009689,6806.1068702290077,9445.3595536514258,4166.8541868065895,5000,10.090076335877868,29.113660302029061,-8.9335076302733256,null,null,41543,null,null,null,null,null,null,null,null,null,null,null,null,null,null,9.9,10.3,91.338925749115631,7.87,0.89,60.3,22,42,"",7200,23,7900,5]
[null,"15:2 Svalövsbäcken nedstr Svalöv","2013-10-29",10.7,9.4,84.949022368736664,7.84,14,50.4,46,80,null,7200,61,8200,6.2,null,2013,10,null,null,null,null,null,null,null,10.541590909090909,13.086650433746245,7.9965313844355723,2.95,7.8355303030303025,8.0354704253415363,7.6355901807190687,6.5,13.161742424242423,43.810002340134545,-17.4865174916497,7,52.671969696969711,62.81683313153323,42.527106262406193,53.603816793893131,125.17443861875186,-17.966805030965602,95.717557251908403,195.19505952555048,-3.759945021733671,100,23,34.313708498984759,11.686291501015239,5893.5877862595416,8596.4199386799191,3190.7556338391637,432.76335877862596,1842.4404130773487,-976.91369552009689,6806.1068702290077,9445.3595536514258,4166.8541868065895,5000,10.090076335877868,29.113660302029061,-8.9335076302733256,null,null,41576,null,null,null,null,null,null,null,null,null,null,null,null,null,null,10.7,9.4,84.949022368736664,7.84,14,50.4,46,80,"",7200,61,8200,6.2]
[null,"15:2 Svalövsbäcken nedstr Svalöv","2013-11-27",5.2,12,94.593829745583605,7.83,5.0999999999999996,53.5,30,48,null,6700,350,8300,6,null,2013,11,null,null,null,null,null,null,null,10.541590909090909,13.086650433746245,7.9965313844355723,2.95,7.8355303030303025,8.0354704253415363,7.6355901807190687,6.5,13.161742424242423,43.810002340134545,-17.4865174916497,7,52.671969696969711,62.81683313153323,42.527106262406193,53.603816793893131,125.17443861875186,-17.966805030965602,95.717557251908403,195.19505952555048,-3.759945021733671,100,23,34.313708498984759,11.686291501015239,5893.5877862595416,8596.4199386799191,3190.7556338391637,432.76335877862596,1842.4404130773487,-976.91369552009689,6806.1068702290077,9445.3595536514258,4166.8541868065895,5000,10.090076335877868,29.113660302029061,-8.9335076302733256,null,null,41605,null,null,null,null,null,null,null,null,null,null,null,null,null,null,5.2,12,94.593829745583605,7.83,5.0999999999999996,53.5,30,48,"",6700,350,8300,6]
[null,"15:2 Svalövsbäcken nedstr Svalöv","2013-12-23",5.3,12.1,95.632614438755269,7.75,8.8000000000000007,43.3,20,40,null,7300,72,7500,6,null,2013,12,null,null,null,null,null,null,null,10.541590909090909,13.086650433746245,7.9965313844355723,2.95,7.8355303030303025,8.0354704253415363,7.6355901807190687,6.5,13.161742424242423,43.810002340134545,-17.4865174916497,7,52.671969696969711,62.81683313153323,42.527106262406193,53.603816793893131,125.17443861875186,-17.966805030965602,95.717557251908403,195.19505952555048,-3.759945021733671,100,23,34.313708498984759,11.686291501015239,5893.5877862595416,8596.4199386799191,3190.7556338391637,432.76335877862596,1842.4404130773487,-976.91369552009689,6806.1068702290077,9445.3595536514258,4166.8541868065895,5000,10.090076335877868,29.113660302029061,-8.9335076302733256,null,null,41631,null,null,null,null,null,null,null,null,null,null,null,null,null,null,5.3,12.1,95.632614438755269,7.75,8.8000000000000007,43.3,20,40,"",7300,72,7500,6]
[null,"15:2 Svalövsbäcken nedstr Svalöv","2014-01-28",0.6,14,97.288503863327747,7.87,11,48.9,21,39,null,5100,290,6500,7,null,2014,1,null,null,null,null,null,null,null,10.541590909090909,13.086650433746245,7.9965313844355723,2.95,7.8355303030303025,8.0354704253415363,7.6355901807190687,6.5,13.161742424242423,43.810002340134545,-17.4865174916497,7,52.671969696969711,62.81683313153323,42.527106262406193,53.603816793893131,125.17443861875186,-17.966805030965602,95.717557251908403,195.19505952555048,-3.759945021733671,100,23,34.313708498984759,11.686291501015239,5893.5877862595416,8596.4199386799191,3190.7556338391637,432.76335877862596,1842.4404130773487,-976.91369552009689,6806.1068702290077,9445.3595536514258,4166.8541868065895,5000,10.090076335877868,29.113660302029061,-8.9335076302733256,null,null,41667,null,null,null,null,null,null,null,null,null,null,null,null,null,null,0.6,14,97.288503863327747,7.87,11,48.9,21,39,"",5100,290,6500,7]
[null,"15:2 Svalövsbäcken nedstr Svalöv","2014-02-27",4.3,12.8,98.523731951852582,7.84,6.7,43.7,19,42,null,5800,210,6400,"<5",null,2014,2,null,null,null,null,null,null,null,10.541590909090909,13.086650433746245,7.9965313844355723,2.95,7.8355303030303025,8.0354704253415363,7.6355901807190687,6.5,13.161742424242423,43.810002340134545,-17.4865174916497,7,52.671969696969711,62.81683313153323,42.527106262406193,53.603816793893131,125.17443861875186,-17.966805030965602,95.717557251908403,195.19505952555048,-3.759945021733671,100,23,34.313708498984759,11.686291501015239,5893.5877862595416,8596.4199386799191,3190.7556338391637,432.76335877862596,1842.4404130773487,-976.91369552009689,6806.1068702290077,9445.3595536514258,4166.8541868065895,5000,10.090076335877868,29.113660302029061,-8.9335076302733256,null,null,41697,null,null,null,null,null,null,null,null,null,null,null,null,null,null,4.3,12.8,98.523731951852582,7.84,6.7,43.7,19,42,"",5800,210,6400,5]
[null,"15:2 Svalövsbäcken nedstr Svalöv","2014-03-27",4.8,14,109.20216018483661,8.06,3.5,44.7,8,21,null,2900,170,3800,"<5",null,2014,3,null,null,null,null,null,null,null,10.541590909090909,13.086650433746245,7.9965313844355723,2.95,7.8355303030303025,8.0354704253415363,7.6355901807190687,6.5,13.161742424242423,43.810002340134545,-17.4865174916497,7,52.671969696969711,62.81683313153323,42.527106262406193,53.603816793893131,125.17443861875186,-17.966805030965602,95.717557251908403,195.19505952555048,-3.759945021733671,100,23,34.313708498984759,11.686291501015239,5893.5877862595416,8596.4199386799191,3190.7556338391637,432.76335877862596,1842.4404130773487,-976.91369552009689,6806.1068702290077,9445.3595536514258,4166.8541868065895,5000,10.090076335877868,29.113660302029061,-8.9335076302733256,null,null,41725,null,null,null,null,null,null,null,null,null,null,null,null,null,null,4.8,14,109.20216018483661,8.06,3.5,44.7,8,21,"",2900,170,3800,5]
[null,"15:2 Svalövsbäcken nedstr Svalöv","2014-04-29",10.1,9.5,84.646448136481311,7.81,1.8,51.2,"<2",20,null,3700,120,4600,"<5",null,2014,4,null,null,null,null,null,null,null,10.541590909090909,13.086650433746245,7.9965313844355723,2.95,7.8355303030303025,8.0354704253415363,7.6355901807190687,6.5,13.161742424242423,43.810002340134545,-17.4865174916497,7,52.671969696969711,62.81683313153323,42.527106262406193,53.603816793893131,125.17443861875186,-17.966805030965602,95.717557251908403,195.19505952555048,-3.759945021733671,100,23,34.313708498984759,11.686291501015239,5893.5877862595416,8596.4199386799191,3190.7556338391637,432.76335877862596,1842.4404130773487,-976.91369552009689,6806.1068702290077,9445.3595536514258,4166.8541868065895,5000,10.090076335877868,29.113660302029061,-8.9335076302733256,null,null,41758,null,null,null,null,null,null,null,null,null,null,null,null,null,null,10.1,9.5,84.646448136481311,7.81,1.8,51.2,2,20,"",3700,120,4600,5]
[null,"15:2 Svalövsbäcken nedstr Svalöv","2014-05-28",12.7,9.6,90.824080351619855,7.78,2.8,51.8,19,41,null,4800,88,6300,"<5",null,2014,5,null,null,null,null,null,null,null,10.541590909090909,13.086650433746245,7.9965313844355723,2.95,7.8355303030303025,8.0354704253415363,7.6355901807190687,6.5,13.161742424242423,43.810002340134545,-17.4865174916497,7,52.671969696969711,62.81683313153323,42.527106262406193,53.603816793893131,125.17443861875186,-17.966805030965602,95.717557251908403,195.19505952555048,-3.759945021733671,100,23,34.313708498984759,11.686291501015239,5893.5877862595416,8596.4199386799191,3190.7556338391637,432.76335877862596,1842.4404130773487,-976.91369552009689,6806.1068702290077,9445.3595536514258,4166.8541868065895,5000,10.090076335877868,29.113660302029061,-8.9335076302733256,null,null,41787,null,null,null,null,null,null,null,null,null,null,null,null,null,null,12.7,9.6,90.824080351619855,7.78,2.8,51.8,19,41,"",4800,88,6300,5]
[null,"15:2 Svalövsbäcken nedstr Svalöv","2014-06-24",12.8,9,85.338223427721587,7.8,4,55.2,17,47,null,4100,57,5400,7.4,"igenväxt",2014,6,null,null,null,null,null,null,null,10.541590909090909,13.086650433746245,7.9965313844355723,2.95,7.8355303030303025,8.0354704253415363,7.6355901807190687,6.5,13.161742424242423,43.810002340134545,-17.4865174916497,7,52.671969696969711,62.81683313153323,42.527106262406193,53.603816793893131,125.17443861875186,-17.966805030965602,95.717557251908403,195.19505952555048,-3.759945021733671,100,23,34.313708498984759,11.686291501015239,5893.5877862595416,8596.4199386799191,3190.7556338391637,432.76335877862596,1842.4404130773487,-976.91369552009689,6806.1068702290077,9445.3595536514258,4166.8541868065895,5000,10.090076335877868,29.113660302029061,-8.9335076302733256,null,null,41814,null,null,null,null,null,null,null,null,null,null,null,null,null,null,12.8,9,85.338223427721587,7.8,4,55.2,17,47,"",4100,57,5400,7.4]
[null,"15:2 Svalövsbäcken nedstr Svalöv","2014-07-21",17.7,7.7,80.95375185156378,7.75,0.91,64.5,39,56,null,6700,36,7500,"<5","igenväxt",2014,7,null,null,null,null,null,null,null,10.541590909090909,13.086650433746245,7.9965313844355723,2.95,7.8355303030303025,8.0354704253415363,7.6355901807190687,6.5,13.161742424242423,43.810002340134545,-17.4865174916497,7,52.671969696969711,62.81683313153323,42.527106262406193,53.603816793893131,125.17443861875186,-17.966805030965602,95.717557251908403,195.19505952555048,-3.759945021733671,100,23,34.313708498984759,11.686291501015239,5893.5877862595416,8596.4199386799191,3190.7556338391637,432.76335877862596,1842.4404130773487,-976.91369552009689,6806.1068702290077,9445.3595536514258,4166.8541868065895,5000,10.090076335877868,29.113660302029061,-8.9335076302733256,null,null,41841,null,null,null,null,null,null,null,null,null,null,null,null,null,null,17.7,7.7,80.95375185156378,7.75,0.91,64.5,39,56,"",6700,36,7500,5]
[null,"15:2 Svalövsbäcken nedstr Svalöv","2014-08-28",14.2,8.3000000000000007,81.159848813224926,7.85,1.8,60.2,24,58,null,6700,22,7900,"<5",null,2014,8,null,null,null,null,null,null,null,10.541590909090909,13.086650433746245,7.9965313844355723,2.95,7.8355303030303025,8.0354704253415363,7.6355901807190687,6.5,13.161742424242423,43.810002340134545,-17.4865174916497,7,52.671969696969711,62.81683313153323,42.527106262406193,53.603816793893131,125.17443861875186,-17.966805030965602,95.717557251908403,195.19505952555048,-3.759945021733671,100,23,34.313708498984759,11.686291501015239,5893.5877862595416,8596.4199386799191,3190.7556338391637,432.76335877862596,1842.4404130773487,-976.91369552009689,6806.1068702290077,9445.3595536514258,4166.8541868065895,5000,10.090076335877868,29.113660302029061,-8.9335076302733256,null,null,41879,null,null,null,null,null,null,null,null,null,null,null,null,null,null,14.2,8.3000000000000007,81.159848813224926,7.85,1.8,60.2,24,58,"",6700,22,7900,5]
[null,"15:2 Svalövsbäcken nedstr Svalöv","2014-09-30",12.6,8.5,80.237084119723704,7.79,1.2,64.599999999999994,63,85,null,9100,130,9700,"<5",null,2014,9,null,null,null,null,null,null,null,10.541590909090909,13.086650433746245,7.9965313844355723,2.95,7.8355303030303025,8.0354704253415363,7.6355901807190687,6.5,13.161742424242423,43.810002340134545,-17.4865174916497,7,52.671969696969711,62.81683313153323,42.527106262406193,53.603816793893131,125.17443861875186,-17.966805030965602,95.717557251908403,195.19505952555048,-3.759945021733671,100,23,34.313708498984759,11.686291501015239,5893.5877862595416,8596.4199386799191,3190.7556338391637,432.76335877862596,1842.4404130773487,-976.91369552009689,6806.1068702290077,9445.3595536514258,4166.8541868065895,5000,10.090076335877868,29.113660302029061,-8.9335076302733256,null,null,41912,null,null,null,null,null,null,null,null,null,null,null,null,null,null,12.6,8.5,80.237084119723704,7.79,1.2,64.599999999999994,63,85,"",9100,130,9700,5]
[null,"15:2 Svalövsbäcken nedstr Svalöv","2014-10-29",10.4,10.199999999999999,91.530983483759925,7.86,10,52.1,39,65,null,7800,78,9000,6.1,null,2014,10,null,null,null,null,null,null,null,10.541590909090909,13.086650433746245,7.9965313844355723,2.95,7.8355303030303025,8.0354704253415363,7.6355901807190687,6.5,13.161742424242423,43.810002340134545,-17.4865174916497,7,52.671969696969711,62.81683313153323,42.527106262406193,53.603816793893131,125.17443861875186,-17.966805030965602,95.717557251908403,195.19505952555048,-3.759945021733671,100,23,34.313708498984759,11.686291501015239,5893.5877862595416,8596.4199386799191,3190.7556338391637,432.76335877862596,1842.4404130773487,-976.91369552009689,6806.1068702290077,9445.3595536514258,4166.8541868065895,5000,10.090076335877868,29.113660302029061,-8.9335076302733256,null,null,41941,null,null,null,null,null,null,null,null,null,null,null,null,null,null,10.4,10.199999999999999,91.530983483759925,7.86,10,52.1,39,65,"",7800,78,9000,6.1]
[null,"15:2 Svalövsbäcken nedstr Svalöv","2014-11-27",6.4,11.7,95.146090176543083,7.95,5.0999999999999996,53.5,43,60,null,6200,81,6800,"<5",null,2014,11,null,null,null,null,null,null,null,10.541590909090909,13.086650433746245,7.9965313844355723,2.95,7.8355303030303025,8.0354704253415363,7.6355901807190687,6.5,13.161742424242423,43.810002340134545,-17.4865174916497,7,52.671969696969711,62.81683313153323,42.527106262406193,53.603816793893131,125.17443861875186,-17.966805030965602,95.717557251908403,195.19505952555048,-3.759945021733671,100,23,34.313708498984759,11.686291501015239,5893.5877862595416,8596.4199386799191,3190.7556338391637,432.76335877862596,1842.4404130773487,-976.91369552009689,6806.1068702290077,9445.3595536514258,4166.8541868065895,5000,10.090076335877868,29.113660302029061,-8.9335076302733256,null,null,41970,null,null,null,null,null,null,null,null,null,null,null,null,null,null,6.4,11.7,95.146090176543083,7.95,5.0999999999999996,53.5,43,60,"",6200,81,6800,5]
[null,"15:2 Svalövsbäcken nedstr Svalöv","2014-12-22",6.5,11.2,91.313647185497629,7.49,250,34.5,74,490,null,6700,12,8200,150,"grumligt",2014,12,null,null,null,null,null,null,null,10.541590909090909,13.086650433746245,7.9965313844355723,2.95,7.8355303030303025,8.0354704253415363,7.6355901807190687,6.5,13.161742424242423,43.810002340134545,-17.4865174916497,7,52.671969696969711,62.81683313153323,42.527106262406193,53.603816793893131,125.17443861875186,-17.966805030965602,95.717557251908403,195.19505952555048,-3.759945021733671,100,23,34.313708498984759,11.686291501015239,5893.5877862595416,8596.4199386799191,3190.7556338391637,432.76335877862596,1842.4404130773487,-976.91369552009689,6806.1068702290077,9445.3595536514258,4166.8541868065895,5000,10.090076335877868,29.113660302029061,-8.9335076302733256,null,null,41995,null,null,null,null,null,null,null,null,null,null,null,null,null,null,6.5,11.2,91.313647185497629,7.49,250,34.5,74,490,"",6700,12,8200,150]
[null,"15:2 Svalövsbäcken nedstr Svalöv","2015-01-27",3.5,12.6,94.918787621417849,7.66,51,35.700000000000003,43,110,null,5900,31,7000,21,null,2015,1,null,null,null,null,null,null,null,10.541590909090909,13.086650433746245,7.9965313844355723,2.95,7.8355303030303025,8.0354704253415363,7.6355901807190687,6.5,13.161742424242423,43.810002340134545,-17.4865174916497,7,52.671969696969711,62.81683313153323,42.527106262406193,53.603816793893131,125.17443861875186,-17.966805030965602,95.717557251908403,195.19505952555048,-3.759945021733671,100,23,34.313708498984759,11.686291501015239,5893.5877862595416,8596.4199386799191,3190.7556338391637,432.76335877862596,1842.4404130773487,-976.91369552009689,6806.1068702290077,9445.3595536514258,4166.8541868065895,5000,10.090076335877868,29.113660302029061,-8.9335076302733256,null,null,42031,null,null,null,null,null,null,null,null,null,null,null,null,null,null,3.5,12.6,94.918787621417849,7.66,51,35.700000000000003,43,110,"",5900,31,7000,21]
[null,"15:2 Svalövsbäcken nedstr Svalöv","2015-02-24",3.5,12.8,96.425435043980031,7.72,22,42.6,20,52,null,6500,24,6800,9,null,2015,2,null,null,null,null,null,null,null,10.541590909090909,13.086650433746245,7.9965313844355723,2.95,7.8355303030303025,8.0354704253415363,7.6355901807190687,6.5,13.161742424242423,43.810002340134545,-17.4865174916497,7,52.671969696969711,62.81683313153323,42.527106262406193,53.603816793893131,125.17443861875186,-17.966805030965602,95.717557251908403,195.19505952555048,-3.759945021733671,100,23,34.313708498984759,11.686291501015239,5893.5877862595416,8596.4199386799191,3190.7556338391637,432.76335877862596,1842.4404130773487,-976.91369552009689,6806.1068702290077,9445.3595536514258,4166.8541868065895,5000,10.090076335877868,29.113660302029061,-8.9335076302733256,null,null,42059,null,null,null,null,null,null,null,null,null,null,null,null,null,null,3.5,12.8,96.425435043980031,7.72,22,42.6,20,52,"",6500,24,6800,9]
[null,"15:2 Svalövsbäcken nedstr Svalöv","2015-03-31",5,10.8,84.687736965595491,7.46,45,39.9,70,110,null,12000,110,12000,22,null,2015,3,null,null,null,null,null,null,null,10.541590909090909,13.086650433746245,7.9965313844355723,2.95,7.8355303030303025,8.0354704253415363,7.6355901807190687,6.5,13.161742424242423,43.810002340134545,-17.4865174916497,7,52.671969696969711,62.81683313153323,42.527106262406193,53.603816793893131,125.17443861875186,-17.966805030965602,95.717557251908403,195.19505952555048,-3.759945021733671,100,23,34.313708498984759,11.686291501015239,5893.5877862595416,8596.4199386799191,3190.7556338391637,432.76335877862596,1842.4404130773487,-976.91369552009689,6806.1068702290077,9445.3595536514258,4166.8541868065895,5000,10.090076335877868,29.113660302029061,-8.9335076302733256,null,null,42094,null,null,null,null,null,null,null,null,null,null,null,null,null,null,5,10.8,84.687736965595491,7.46,45,39.9,70,110,"",12000,110,12000,22]
[null,"15:2 Svalövsbäcken nedstr Svalöv","2015-04-29",8.1,10.6,89.975107902268277,7.94,2.8,46.9,5.8,25,null,4400,190,4900,"<5",null,2015,4,null,null,null,null,null,null,null,{"$f":"$E$145","v":10.541590909090909},{"$f":"AA74+E$146","v":13.086650433746245},{"$f":"AA74-E$146","v":7.9965313844355723},2.95,{"$f":"$G$145","v":7.8355303030303025},{"$f":"AE74+G$146","v":8.0354704253415363},{"$f":"AE74-G$146","v":7.6355901807190687},6.5,{"$f":"$H$145","v":13.161742424242423},{"$f":"AI74+H$146","v":43.810002340134545},{"$f":"AI74-H$146","v":-17.4865174916497},7,{"$f":"$I$145","v":52.671969696969711},{"$f":"AM74+I$146","v":62.81683313153323},{"$f":"AM74-I$146","v":42.527106262406193},{"$f":"$J$145","v":53.603816793893131},{"$f":"AP74+J$146","v":125.17443861875186},{"$f":"AP74-J$146","v":-17.966805030965602},{"$f":"$K$145","v":95.717557251908403},{"$f":"AS74+$K$146","v":195.19505952555048},{"$f":"AS74-$K$146","v":-3.759945021733671},100,{"$f":"$L$145","v":23},{"$f":"AW74+$L$146","v":34.313708498984759},{"$f":"AW74-$L$146","v":11.686291501015239},{"$f":"$M$145","v":5893.5877862595416},{"$f":"AZ74+$M$146","v":8596.4199386799191},{"$f":"AZ74-$M$146","v":3190.7556338391637},{"$f":"$N$145","v":432.76335877862596},{"$f":"BC74+$N$146","v":1842.4404130773487},{"$f":"BC74-$N$146","v":-976.91369552009689},{"$f":"$O$145","v":6806.1068702290077},{"$f":"BF74+$O$146","v":9445.3595536514258},{"$f":"BF74-$O$146","v":4166.8541868065895},5000,{"$f":"$P$145","v":10.090076335877868},{"$f":"BJ74+$P$146","v":29.113660302029061},{"$f":"BJ74-$P$146","v":-8.9335076302733256},null,null,{"$f":"C74","v":42123},null,null,null,null,null,null,null,null,null,null,null,null,null,null,{"$f":"IF(D74=\"\",\"\",IF(OR(LEFT(D74,1)=\"<\",LEFT(D74,1)=\">\"),VALUE(MID(D74,2,3)),D74))","v":8.1},{"$f":"IF(E74=\"\",\"\",IF(OR(LEFT(E74,1)=\"<\",LEFT(E74,1)=\">\"),VALUE(MID(E74,2,3)),E74))","v":10.6},{"$f":"IF(F74=\"\",\"\",IF(OR(LEFT(F74,1)=\"<\",LEFT(F74,1)=\">\"),VALUE(MID(F74,2,3)),F74))","v":89.975107902268277},{"$f":"IF(G74=\"\",\"\",IF(OR(LEFT(G74,1)=\"<\",LEFT(G74,1)=\">\"),VALUE(MID(G74,2,3)),G74))","v":7.94},{"$f":"IF(H74=\"\",\"\",IF(OR(LEFT(H74,1)=\"<\",LEFT(H74,1)=\">\"),VALUE(MID(H74,2,3)),H74))","v":2.8},{"$f":"IF(I74=\"\",\"\",IF(OR(LEFT(I74,1)=\"<\",LEFT(I74,1)=\">\"),VALUE(MID(I74,2,3)),I74))","v":46.9},{"$f":"IF(J74=\"\",\"\",IF(OR(LEFT(J74,1)=\"<\",LEFT(J74,1)=\">\"),VALUE(MID(J74,2,3)),J74))","v":5.8},{"$f":"IF(K74=\"\",\"\",IF(OR(LEFT(K74,1)=\"<\",LEFT(K74,1)=\">\"),VALUE(MID(K74,2,3)),K74))","v":25},{"$f":"IF(L74=\"\",\"\",IF(OR(LEFT(L74,1)=\"<\",LEFT(L74,1)=\">\"),VALUE(MID(L74,2,3)),L74))","v":""},{"$f":"IF(M74=\"\",\"\",IF(OR(LEFT(M74,1)=\"<\",LEFT(M74,1)=\">\"),VALUE(MID(M74,2,3)),M74))","v":4400},{"$f":"IF(N74=\"\",\"\",IF(OR(LEFT(N74,1)=\"<\",LEFT(N74,1)=\">\"),VALUE(MID(N74,2,3)),N74))","v":190},{"$f":"IF(O74=\"\",\"\",IF(OR(LEFT(O74,1)=\"<\",LEFT(O74,1)=\">\"),VALUE(MID(O74,2,3)),O74))","v":4900},{"$f":"IF(P74=\"\",\"\",IF(OR(LEFT(P74,1)=\"<\",LEFT(P74,1)=\">\"),VALUE(MID(P74,2,3)),P74))","v":5}]
[null,"15:2 Svalövsbäcken nedstr Svalöv","2015-05-27",11.6,10.8,99.659898491650551,8.0399999999999991,2.8,49.6,25,56,null,1100,34,4600,"<5",null,2015,5,null,null,null,null,null,null,null,10.541590909090909,13.086650433746245,7.9965313844355723,2.95,7.8355303030303025,8.0354704253415363,7.6355901807190687,6.5,13.161742424242423,43.810002340134545,-17.4865174916497,7,52.671969696969711,62.81683313153323,42.527106262406193,53.603816793893131,125.17443861875186,-17.966805030965602,95.717557251908403,195.19505952555048,-3.759945021733671,100,23,34.313708498984759,11.686291501015239,5893.5877862595416,8596.4199386799191,3190.7556338391637,432.76335877862596,1842.4404130773487,-976.91369552009689,6806.1068702290077,9445.3595536514258,4166.8541868065895,5000,10.090076335877868,29.113660302029061,-8.9335076302733256,null,null,42151,null,null,null,null,null,null,null,null,null,null,null,null,null,null,11.6,10.8,99.659898491650551,8.0399999999999991,2.8,49.6,25,56,"",1100,34,4600,5]
[null,"15:2 Svalövsbäcken nedstr Svalöv","2015-06-25",12.7,9.11,86.188267917005916,7.83,3.6,53.8,71,110,null,4500,120,5000,"<5",null,2015,6,null,null,null,null,null,null,null,10.541590909090909,13.086650433746245,7.9965313844355723,2.95,7.8355303030303025,8.0354704253415363,7.6355901807190687,6.5,13.161742424242423,43.810002340134545,-17.4865174916497,7,52.671969696969711,62.81683313153323,42.527106262406193,53.603816793893131,125.17443861875186,-17.966805030965602,95.717557251908403,195.19505952555048,-3.759945021733671,100,23,34.313708498984759,11.686291501015239,5893.5877862595416,8596.4199386799191,3190.7556338391637,432.76335877862596,1842.4404130773487,-976.91369552009689,6806.1068702290077,9445.3595536514258,4166.8541868065895,5000,10.090076335877868,29.113660302029061,-8.9335076302733256,null,null,42180,null,null,null,null,null,null,null,null,null,null,null,null,null,null,12.7,9.11,86.188267917005916,7.83,3.6,53.8,71,110,"",4500,120,5000,5]
[null,"15:2 Svalövsbäcken nedstr Svalöv","2015-07-28",15.7,7.4,74.700374170274671,7.76,11,38.9,74,120,null,2900,130,3200,9.4,null,2015,7,null,null,null,null,null,null,null,10.541590909090909,13.086650433746245,7.9965313844355723,2.95,7.8355303030303025,8.0354704253415363,7.6355901807190687,6.5,13.161742424242423,43.810002340134545,-17.4865174916497,7,52.671969696969711,62.81683313153323,42.527106262406193,53.603816793893131,125.17443861875186,-17.966805030965602,95.717557251908403,195.19505952555048,-3.759945021733671,100,23,34.313708498984759,11.686291501015239,5893.5877862595416,8596.4199386799191,3190.7556338391637,432.76335877862596,1842.4404130773487,-976.91369552009689,6806.1068702290077,9445.3595536514258,4166.8541868065895,5000,10.090076335877868,29.113660302029061,-8.9335076302733256,null,null,42213,null,null,null,null,null,null,null,null,null,null,null,null,null,null,15.7,7.4,74.700374170274671,7.76,11,38.9,74,120,"",2900,130,3200,9.4]
[null,"15:2 Svalövsbäcken nedstr Svalöv","2015-08-26",15.2,8.5,84.909584510051999,7.71,1,49.7,100,150,null,4500,170,4800,7.2,null,2015,8,null,null,null,null,null,null,null,10.541590909090909,13.086650433746245,7.9965313844355723,2.95,7.8355303030303025,8.0354704253415363,7.6355901807190687,6.5,13.161742424242423,43.810002340134545,-17.4865174916497,7,52.671969696969711,62.81683313153323,42.527106262406193,53.603816793893131,125.17443861875186,-17.966805030965602,95.717557251908403,195.19505952555048,-3.759945021733671,100,23,34.313708498984759,11.686291501015239,5893.5877862595416,8596.4199386799191,3190.7556338391637,432.76335877862596,1842.4404130773487,-976.91369552009689,6806.1068702290077,9445.3595536514258,4166.8541868065895,5000,10.090076335877868,29.113660302029061,-8.9335076302733256,null,null,42242,null,null,null,null,null,null,null,null,null,null,null,null,null,null,15.2,8.5,84.909584510051999,7.71,1,49.7,100,150,"",4500,170,4800,7.2]
[null,"15:2 Svalövsbäcken nedstr Svalöv","2015-09-30",13.1,10.5,100.22840352192868,7.89,4.7,59,26,60,null,6800,98,6500,"<5",null,2015,9,null,null,null,null,null,null,null,10.541590909090909,13.086650433746245,7.9965313844355723,2.95,7.8355303030303025,8.0354704253415363,7.6355901807190687,6.5,13.161742424242423,43.810002340134545,-17.4865174916497,7,52.671969696969711,62.81683313153323,42.527106262406193,53.603816793893131,125.17443861875186,-17.966805030965602,95.717557251908403,195.19505952555048,-3.759945021733671,100,23,34.313708498984759,11.686291501015239,5893.5877862595416,8596.4199386799191,3190.7556338391637,432.76335877862596,1842.4404130773487,-976.91369552009689,6806.1068702290077,9445.3595536514258,4166.8541868065895,5000,10.090076335877868,29.113660302029061,-8.9335076302733256,null,null,42277,null,null,null,null,null,null,null,null,null,null,null,null,null,null,13.1,10.5,100.22840352192868,7.89,4.7,59,26,60,"",6800,98,6500,5]
[null,"15:2 Svalövsbäcken nedstr Svalöv","2015-10-28",8.1999999999999993,9.6999999999999993,82.539714829588078,7.86,2,60.6,36,56,null,6300,44,6300,"<5",null,2015,10,null,null,null,null,null,null,null,10.541590909090909,13.086650433746245,7.9965313844355723,2.95,7.8355303030303025,8.0354704253415363,7.6355901807190687,6.5,13.161742424242423,43.810002340134545,-17.4865174916497,7,52.671969696969711,62.81683313153323,42.527106262406193,53.603816793893131,125.17443861875186,-17.966805030965602,95.717557251908403,195.19505952555048,-3.759945021733671,100,23,34.313708498984759,11.686291501015239,5893.5877862595416,8596.4199386799191,3190.7556338391637,432.76335877862596,1842.4404130773487,-976.91369552009689,6806.1068702290077,9445.3595536514258,4166.8541868065895,5000,10.090076335877868,29.113660302029061,-8.9335076302733256,null,null,42305,null,null,null,null,null,null,null,null,null,null,null,null,null,null,8.1999999999999993,9.6999999999999993,82.539714829588078,7.86,2,60.6,36,56,"",6300,44,6300,5]
[null,"15:2 Svalövsbäcken nedstr Svalöv","2015-12-21",7.7,11.1,93.286386221021587,7.81,9.8000000000000007,48.1,30,60,null,6800,120,7000,6.1,null,2015,12,null,null,null,null,null,null,null,10.541590909090909,13.086650433746245,7.9965313844355723,2.95,7.8355303030303025,8.0354704253415363,7.6355901807190687,6.5,13.161742424242423,43.810002340134545,-17.4865174916497,7,52.671969696969711,62.81683313153323,42.527106262406193,53.603816793893131,125.17443861875186,-17.966805030965602,95.717557251908403,195.19505952555048,-3.759945021733671,100,23,34.313708498984759,11.686291501015239,5893.5877862595416,8596.4199386799191,3190.7556338391637,432.76335877862596,1842.4404130773487,-976.91369552009689,6806.1068702290077,9445.3595536514258,4166.8541868065895,5000,10.090076335877868,29.113660302029061,-8.9335076302733256,null,null,42359,null,null,null,null,null,null,null,null,null,null,null,null,null,null,7.7,11.1,93.286386221021587,7.81,9.8000000000000007,48.1,30,60,"",6800,120,7000,6.1]
[null,"15:2 Svalövsbäcken nedstr Svalöv","2016-01-27",3.6,11.8,89.133286214788114,7.61,33,38.799999999999997,41,100,null,4100,180,4700,31,null,2016,1,null,null,null,null,null,null,null,10.541590909090909,13.086650433746245,7.9965313844355723,2.95,7.8355303030303025,8.0354704253415363,7.6355901807190687,6.5,13.161742424242423,43.810002340134545,-17.4865174916497,7,52.671969696969711,62.81683313153323,42.527106262406193,53.603816793893131,125.17443861875186,-17.966805030965602,95.717557251908403,195.19505952555048,-3.759945021733671,100,23,34.313708498984759,11.686291501015239,5893.5877862595416,8596.4199386799191,3190.7556338391637,432.76335877862596,1842.4404130773487,-976.91369552009689,6806.1068702290077,9445.3595536514258,4166.8541868065895,5000,10.090076335877868,29.113660302029061,-8.9335076302733256,null,null,42396,null,null,null,null,null,null,null,null,null,null,null,null,null,null,3.6,11.8,89.133286214788114,7.61,33,38.799999999999997,41,100,"",4100,180,4700,31]
[null,"15:2 Svalövsbäcken nedstr Svalöv","2016-02-25",3.4,11.6,87.1487538448593,7.84,8.5,40.700000000000003,24,54,null,6000,17,5900,5.9,null,2016,2,null,null,null,null,null,null,null,10.541590909090909,13.086650433746245,7.9965313844355723,2.95,7.8355303030303025,8.0354704253415363,7.6355901807190687,6.5,13.161742424242423,43.810002340134545,-17.4865174916497,7,52.671969696969711,62.81683313153323,42.527106262406193,53.603816793893131,125.17443861875186,-17.966805030965602,95.717557251908403,195.19505952555048,-3.759945021733671,100,23,34.313708498984759,11.686291501015239,5893.5877862595416,8596.4199386799191,3190.7556338391637,432.76335877862596,1842.4404130773487,-976.91369552009689,6806.1068702290077,9445.3595536514258,4166.8541868065895,5000,10.090076335877868,29.113660302029061,-8.9335076302733256,null,null,42425,null,null,null,null,null,null,null,null,null,null,null,null,null,null,3.4,11.6,87.1487538448593,7.84,8.5,40.700000000000003,24,54,"",6000,17,5900,5.9]
[null,"15:2 Svalövsbäcken nedstr Svalöv","2016-03-30",6.5,11.3,92.128947606796714,7.94,2.5,45.9,22,29,null,3900,130,3700,"<5",null,2016,3,null,null,null,null,null,null,null,10.541590909090909,13.086650433746245,7.9965313844355723,2.95,7.8355303030303025,8.0354704253415363,7.6355901807190687,6.5,13.161742424242423,43.810002340134545,-17.4865174916497,7,52.671969696969711,62.81683313153323,42.527106262406193,53.603816793893131,125.17443861875186,-17.966805030965602,95.717557251908403,195.19505952555048,-3.759945021733671,100,23,34.313708498984759,11.686291501015239,5893.5877862595416,8596.4199386799191,3190.7556338391637,432.76335877862596,1842.4404130773487,-976.91369552009689,6806.1068702290077,9445.3595536514258,4166.8541868065895,5000,10.090076335877868,29.113660302029061,-8.9335076302733256,null,null,42459,null,null,null,null,null,null,null,null,null,null,null,null,null,null,6.5,11.3,92.128947606796714,7.94,2.5,45.9,22,29,"",3900,130,3700,5]
[null,"15:2 Svalövsbäcken nedstr Svalöv","2016-04-27",5.9,10.3,82.688701464530894,7.88,5.4,43.2,33,52,null,2900,190,3700,7.1,null,2016,4,null,null,null,null,null,null,null,10.541590909090909,13.086650433746245,7.9965313844355723,2.95,7.8355303030303025,8.0354704253415363,7.6355901807190687,6.5,13.161742424242423,43.810002340134545,-17.4865174916497,7,52.671969696969711,62.81683313153323,42.527106262406193,53.603816793893131,125.17443861875186,-17.966805030965602,95.717557251908403,195.19505952555048,-3.759945021733671,100,23,34.313708498984759,11.686291501015239,5893.5877862595416,8596.4199386799191,3190.7556338391637,432.76335877862596,1842.4404130773487,-976.91369552009689,6806.1068702290077,9445.3595536514258,4166.8541868065895,5000,10.090076335877868,29.113660302029061,-8.9335076302733256,null,null,42487,null,null,null,null,null,null,null,null,null,null,null,null,null,null,5.9,10.3,82.688701464530894,7.88,5.4,43.2,33,52,"",2900,190,3700,7.1]
[null,"15:2 Svalövsbäcken nedstr Svalöv","2016-05-31",16.7,7.3,75.223379286442182,7.74,2,55.8,130,150,null,3500,240,4100,"<5",null,2016,5,null,null,null,null,null,null,null,10.541590909090909,13.086650433746245,7.9965313844355723,2.95,7.8355303030303025,8.0354704253415363,7.6355901807190687,6.5,13.161742424242423,43.810002340134545,-17.4865174916497,7,52.671969696969711,62.81683313153323,42.527106262406193,53.603816793893131,125.17443861875186,-17.966805030965602,95.717557251908403,195.19505952555048,-3.759945021733671,100,23,34.313708498984759,11.686291501015239,5893.5877862595416,8596.4199386799191,3190.7556338391637,432.76335877862596,1842.4404130773487,-976.91369552009689,6806.1068702290077,9445.3595536514258,4166.8541868065895,5000,10.090076335877868,29.113660302029061,-8.9335076302733256,null,null,42521,null,null,null,null,null,null,null,null,null,null,null,null,null,null,16.7,7.3,75.223379286442182,7.74,2,55.8,130,150,"",3500,240,4100,5]
[null,"15:2 Svalövsbäcken nedstr Svalöv","2016-06-28",16.399999999999999,7.3,74.764354751905003,7.68,2.7,39.799999999999997,100,160,null,3100,120,3200,"<5",null,2016,6,null,null,null,null,null,null,null,10.541590909090909,13.086650433746245,7.9965313844355723,2.95,7.8355303030303025,8.0354704253415363,7.6355901807190687,6.5,13.161742424242423,43.810002340134545,-17.4865174916497,7,52.671969696969711,62.81683313153323,42.527106262406193,53.603816793893131,125.17443861875186,-17.966805030965602,95.717557251908403,195.19505952555048,-3.759945021733671,100,23,34.313708498984759,11.686291501015239,5893.5877862595416,8596.4199386799191,3190.7556338391637,432.76335877862596,1842.4404130773487,-976.91369552009689,6806.1068702290077,9445.3595536514258,4166.8541868065895,5000,10.090076335877868,29.113660302029061,-8.9335076302733256,null,null,42549,null,null,null,null,null,null,null,null,null,null,null,null,null,null,16.399999999999999,7.3,74.764354751905003,7.68,2.7,39.799999999999997,100,160,"",3100,120,3200,5]
[null,"15:2 Svalövsbäcken nedstr Svalöv","2016-07-26",18.3,7.7,81.914421394095513,7.77,1.8,66.3,59,94,null,7500,110,7700,"<5",null,2016,7,null,null,null,null,null,null,null,10.541590909090909,13.086650433746245,7.9965313844355723,2.95,7.8355303030303025,8.0354704253415363,7.6355901807190687,6.5,13.161742424242423,43.810002340134545,-17.4865174916497,7,52.671969696969711,62.81683313153323,42.527106262406193,53.603816793893131,125.17443861875186,-17.966805030965602,95.717557251908403,195.19505952555048,-3.759945021733671,100,23,34.313708498984759,11.686291501015239,5893.5877862595416,8596.4199386799191,3190.7556338391637,432.76335877862596,1842.4404130773487,-976.91369552009689,6806.1068702290077,9445.3595536514258,4166.8541868065895,5000,10.090076335877868,29.113660302029061,-8.9335076302733256,null,null,42577,null,null,null,null,null,null,null,null,null,null,null,null,null,null,18.3,7.7,81.914421394095513,7.77,1.8,66.3,59,94,"",7500,110,7700,5]
[null,"15:2 Svalövsbäcken nedstr Svalöv","2016-08-30",14.9,7.1,70.475359374506397,7.63,1.4,54.2,58,77,null,7200,200,6800,"<5",null,2016,8,null,null,null,null,null,null,null,10.541590909090909,13.086650433746245,7.9965313844355723,2.95,7.8355303030303025,8.0354704253415363,7.6355901807190687,6.5,13.161742424242423,43.810002340134545,-17.4865174916497,7,52.671969696969711,62.81683313153323,42.527106262406193,53.603816793893131,125.17443861875186,-17.966805030965602,95.717557251908403,195.19505952555048,-3.759945021733671,100,23,34.313708498984759,11.686291501015239,5893.5877862595416,8596.4199386799191,3190.7556338391637,432.76335877862596,1842.4404130773487,-976.91369552009689,6806.1068702290077,9445.3595536514258,4166.8541868065895,5000,10.090076335877868,29.113660302029061,-8.9335076302733256,null,null,42612,null,null,null,null,null,null,null,null,null,null,null,null,null,null,14.9,7.1,70.475359374506397,7.63,1.4,54.2,58,77,"",7200,200,6800,5]
[null,"15:2 Svalövsbäcken nedstr Svalöv","2016-09-27",12.2,8.6999999999999993,81.387683033976501,7.83,2.5,70.55,30,58,null,11000,54,12000,"<5",null,2016,9,null,null,null,null,null,null,null,10.541590909090909,13.086650433746245,7.9965313844355723,2.95,7.8355303030303025,8.0354704253415363,7.6355901807190687,6.5,13.161742424242423,43.810002340134545,-17.4865174916497,7,52.671969696969711,62.81683313153323,42.527106262406193,53.603816793893131,125.17443861875186,-17.966805030965602,95.717557251908403,195.19505952555048,-3.759945021733671,100,23,34.313708498984759,11.686291501015239,5893.5877862595416,8596.4199386799191,3190.7556338391637,432.76335877862596,1842.4404130773487,-976.91369552009689,6806.1068702290077,9445.3595536514258,4166.8541868065895,5000,10.090076335877868,29.113660302029061,-8.9335076302733256,null,null,42640,null,null,null,null,null,null,null,null,null,null,null,null,null,null,12.2,8.6999999999999993,81.387683033976501,7.83,2.5,70.55,30,58,"",11000,54,12000,5]
[null,"15:2 Svalövsbäcken nedstr Svalöv","2016-10-26",8.1,9.4,79.789246630313386,7.78,1.3,65.7,170,230,null,6900,210,7400,"<5",null,2016,10,null,null,null,null,null,null,null,10.541590909090909,13.086650433746245,7.9965313844355723,2.95,7.8355303030303025,8.0354704253415363,7.6355901807190687,6.5,13.161742424242423,43.810002340134545,-17.4865174916497,7,52.671969696969711,62.81683313153323,42.527106262406193,53.603816793893131,125.17443861875186,-17.966805030965602,95.717557251908403,195.19505952555048,-3.759945021733671,100,23,34.313708498984759,11.686291501015239,5893.5877862595416,8596.4199386799191,3190.7556338391637,432.76335877862596,1842.4404130773487,-976.91369552009689,6806.1068702290077,9445.3595536514258,4166.8541868065895,5000,10.090076335877868,29.113660302029061,-8.9335076302733256,null,null,42669,null,null,null,null,null,null,null,null,null,null,null,null,null,null,8.1,9.4,79.789246630313386,7.78,1.3,65.7,170,230,"",6900,210,7400,5]
[null,"15:2 Svalövsbäcken nedstr Svalöv","2016-11-29",2.8,12.1,89.427771107201053,7.85,3.6,59.5,19,99,null,8600,240,9300,"<5",null,2016,11,null,null,null,null,null,null,null,10.541590909090909,13.086650433746245,7.9965313844355723,2.95,7.8355303030303025,8.0354704253415363,7.6355901807190687,6.5,13.161742424242423,43.810002340134545,-17.4865174916497,7,52.671969696969711,62.81683313153323,42.527106262406193,53.603816793893131,125.17443861875186,-17.966805030965602,95.717557251908403,195.19505952555048,-3.759945021733671,100,23,34.313708498984759,11.686291501015239,5893.5877862595416,8596.4199386799191,3190.7556338391637,432.76335877862596,1842.4404130773487,-976.91369552009689,6806.1068702290077,9445.3595536514258,4166.8541868065895,5000,10.090076335877868,29.113660302029061,-8.9335076302733256,null,null,42703,null,null,null,null,null,null,null,null,null,null,null,null,null,null,2.8,12.1,89.427771107201053,7.85,3.6,59.5,19,99,"",8600,240,9300,5]
[null,"15:2 Svalövsbäcken nedstr Svalöv","2016-12-28",3.1,12.7,null,7.95,11,54.4,27,69,null,10000,140,10000,9.6,null,2016,12,null,null,null,null,null,null,null,10.541590909090909,13.086650433746245,7.9965313844355723,2.95,7.8355303030303025,8.0354704253415363,7.6355901807190687,6.5,13.161742424242423,43.810002340134545,-17.4865174916497,7,52.671969696969711,62.81683313153323,42.527106262406193,53.603816793893131,125.17443861875186,-17.966805030965602,95.717557251908403,195.19505952555048,-3.759945021733671,100,23,34.313708498984759,11.686291501015239,5893.5877862595416,8596.4199386799191,3190.7556338391637,432.76335877862596,1842.4404130773487,-976.91369552009689,6806.1068702290077,9445.3595536514258,4166.8541868065895,5000,10.090076335877868,29.113660302029061,-8.9335076302733256,null,null,42732,null,null,null,null,null,null,null,null,null,null,null,null,null,null,3.1,12.7,"",7.95,11,54.4,27,69,"",10000,140,10000,9.6]
[null,"15:2 Svalövsbäcken nedstr Svalöv","2017-01-31",3.2,12.4,92.653425760077297,7.86,3.1,55.8,19,40,null,9800,480,10000,"<5",null,2017,1,null,null,null,null,null,null,null,10.541590909090909,13.086650433746245,7.9965313844355723,2.95,7.8355303030303025,8.0354704253415363,7.6355901807190687,6.5,13.161742424242423,43.810002340134545,-17.4865174916497,7,52.671969696969711,62.81683313153323,42.527106262406193,53.603816793893131,125.17443861875186,-17.966805030965602,95.717557251908403,195.19505952555048,-3.759945021733671,100,23,34.313708498984759,11.686291501015239,5893.5877862595416,8596.4199386799191,3190.7556338391637,432.76335877862596,1842.4404130773487,-976.91369552009689,6806.1068702290077,9445.3595536514258,4166.8541868065895,5000,10.090076335877868,29.113660302029061,-8.9335076302733256,null,null,42766,null,null,null,null,null,null,null,null,null,null,null,null,null,null,3.2,12.4,92.653425760077297,7.86,3.1,55.8,19,40,"",9800,480,10000,5]
[null,"15:2 Svalövsbäcken nedstr Svalöv","2017-02-28",4.9000000000000004,11.7,91.503339110459009,7.68,24,45.3,38,77,null,14000,88,14000,12,null,2017,2,null,null,null,null,null,null,null,10.541590909090909,13.086650433746245,7.9965313844355723,2.95,7.8355303030303025,8.0354704253415363,7.6355901807190687,6.5,13.161742424242423,43.810002340134545,-17.4865174916497,7,52.671969696969711,62.81683313153323,42.527106262406193,53.603816793893131,125.17443861875186,-17.966805030965602,95.717557251908403,195.19505952555048,-3.759945021733671,100,23,34.313708498984759,11.686291501015239,5893.5877862595416,8596.4199386799191,3190.7556338391637,432.76335877862596,1842.4404130773487,-976.91369552009689,6806.1068702290077,9445.3595536514258,4166.8541868065895,5000,10.090076335877868,29.113660302029061,-8.9335076302733256,null,null,42794,null,null,null,null,null,null,null,null,null,null,null,null,null,null,4.9000000000000004,11.7,91.503339110459009,7.68,24,45.3,38,77,"",14000,88,14000,12]
[null,"15:2 Svalövsbäcken nedstr Svalöv","2017-03-28",6.4,11.5,93.519661284636371,7.89,4.7,49.2,3.8,25,null,8300,200,8600,"<5",null,2017,3,null,null,null,null,null,null,null,10.541590909090909,13.086650433746245,7.9965313844355723,2.95,7.8355303030303025,8.0354704253415363,7.6355901807190687,6.5,13.161742424242423,43.810002340134545,-17.4865174916497,7,52.671969696969711,62.81683313153323,42.527106262406193,53.603816793893131,125.17443861875186,-17.966805030965602,95.717557251908403,195.19505952555048,-3.759945021733671,100,23,34.313708498984759,11.686291501015239,5893.5877862595416,8596.4199386799191,3190.7556338391637,432.76335877862596,1842.4404130773487,-976.91369552009689,6806.1068702290077,9445.3595536514258,4166.8541868065895,5000,10.090076335877868,29.113660302029061,-8.9335076302733256,null,null,42822,null,null,null,null,null,null,null,null,null,null,null,null,null,null,6.4,11.5,93.519661284636371,7.89,4.7,49.2,3.8,25,"",8300,200,8600,5]
[null,"15:2 Svalövsbäcken nedstr Svalöv","2017-04-26",6.4,12.8,104.09144908203005,8.0399999999999991,2.2999999999999998,49.9,6.2,23,null,4400,180,5100,"<5",null,2017,4,null,null,null,null,null,null,null,10.541590909090909,13.086650433746245,7.9965313844355723,2.95,7.8355303030303025,8.0354704253415363,7.6355901807190687,6.5,13.161742424242423,43.810002340134545,-17.4865174916497,7,52.671969696969711,62.81683313153323,42.527106262406193,53.603816793893131,125.17443861875186,-17.966805030965602,95.717557251908403,195.19505952555048,-3.759945021733671,100,23,34.313708498984759,11.686291501015239,5893.5877862595416,8596.4199386799191,3190.7556338391637,432.76335877862596,1842.4404130773487,-976.91369552009689,6806.1068702290077,9445.3595536514258,4166.8541868065895,5000,10.090076335877868,29.113660302029061,-8.9335076302733256,null,null,42851,null,null,null,null,null,null,null,null,null,null,null,null,null,null,6.4,12.8,104.09144908203005,8.0399999999999991,2.2999999999999998,49.9,6.2,23,"",4400,180,5100,5]
[null,"15:2 Svalövsbäcken nedstr Svalöv","2017-05-30",14.6,7.2,71.012111095779161,7.69,2.4,63.3,140,170,null,6300,440,6500,"<5",null,2017,5,null,null,null,null,null,null,null,10.541590909090909,13.086650433746245,7.9965313844355723,2.95,7.8355303030303025,8.0354704253415363,7.6355901807190687,6.5,13.161742424242423,43.810002340134545,-17.4865174916497,7,52.671969696969711,62.81683313153323,42.527106262406193,53.603816793893131,125.17443861875186,-17.966805030965602,95.717557251908403,195.19505952555048,-3.759945021733671,100,23,34.313708498984759,11.686291501015239,5893.5877862595416,8596.4199386799191,3190.7556338391637,432.76335877862596,1842.4404130773487,-976.91369552009689,6806.1068702290077,9445.3595536514258,4166.8541868065895,5000,10.090076335877868,29.113660302029061,-8.9335076302733256,null,null,42885,null,null,null,null,null,null,null,null,null,null,null,null,null,null,14.6,7.2,71.012111095779161,7.69,2.4,63.3,140,170,"",6300,440,6500,5]
[null,"15:2 Svalövsbäcken nedstr Svalöv","2017-06-27",13.7,8.1999999999999993,79.31502117354286,7.82,1.9,61.3,100,130,null,5200,110,5500,"<5",null,2017,6,null,null,null,null,null,null,null,10.541590909090909,13.086650433746245,7.9965313844355723,2.95,7.8355303030303025,8.0354704253415363,7.6355901807190687,6.5,13.161742424242423,43.810002340134545,-17.4865174916497,7,52.671969696969711,62.81683313153323,42.527106262406193,53.603816793893131,125.17443861875186,-17.966805030965602,95.717557251908403,195.19505952555048,-3.759945021733671,100,23,34.313708498984759,11.686291501015239,5893.5877862595416,8596.4199386799191,3190.7556338391637,432.76335877862596,1842.4404130773487,-976.91369552009689,6806.1068702290077,9445.3595536514258,4166.8541868065895,5000,10.090076335877868,29.113660302029061,-8.9335076302733256,null,null,42913,null,null,null,null,null,null,null,null,null,null,null,null,null,null,13.7,8.1999999999999993,79.31502117354286,7.82,1.9,61.3,100,130,"",5200,110,5500,5]
[null,"15:2 Svalövsbäcken nedstr Svalöv","2017-07-31",16.399999999999999,6.8,69.643508536021102,7.69,3.7,52,42,88,null,3200,640,4200,"<5",null,2017,7,null,null,null,null,null,null,null,10.541590909090909,13.086650433746245,7.9965313844355723,2.95,7.8355303030303025,8.0354704253415363,7.6355901807190687,6.5,13.161742424242423,43.810002340134545,-17.4865174916497,7,52.671969696969711,62.81683313153323,42.527106262406193,53.603816793893131,125.17443861875186,-17.966805030965602,95.717557251908403,195.19505952555048,-3.759945021733671,100,23,34.313708498984759,11.686291501015239,5893.5877862595416,8596.4199386799191,3190.7556338391637,432.76335877862596,1842.4404130773487,-976.91369552009689,6806.1068702290077,9445.3595536514258,4166.8541868065895,5000,10.090076335877868,29.113660302029061,-8.9335076302733256,null,null,42947,null,null,null,null,null,null,null,null,null,null,null,null,null,null,16.399999999999999,6.8,69.643508536021102,7.69,3.7,52,42,88,"",3200,640,4200,5]
[null,"15:2 Svalövsbäcken nedstr Svalöv","2017-08-29",16.100000000000001,7.4,75.322570230888573,7.76,9.1,55.2,8.1,58,null,3400,190,4200,6,null,2017,8,null,null,null,null,null,null,null,10.541590909090909,13.086650433746245,7.9965313844355723,2.95,7.8355303030303025,8.0354704253415363,7.6355901807190687,6.5,13.161742424242423,43.810002340134545,-17.4865174916497,7,52.671969696969711,62.81683313153323,42.527106262406193,53.603816793893131,125.17443861875186,-17.966805030965602,95.717557251908403,195.19505952555048,-3.759945021733671,100,23,34.313708498984759,11.686291501015239,5893.5877862595416,8596.4199386799191,3190.7556338391637,432.76335877862596,1842.4404130773487,-976.91369552009689,6806.1068702290077,9445.3595536514258,4166.8541868065895,5000,10.090076335877868,29.113660302029061,-8.9335076302733256,null,null,42976,null,null,null,null,null,null,null,null,null,null,null,null,null,null,16.100000000000001,7.4,75.322570230888573,7.76,9.1,55.2,8.1,58,"",3400,190,4200,6]
[null,"15:2 Svalövsbäcken nedstr Svalöv","2017-09-25",13.7,9.3000000000000007,89.95484108706691,7.82,5.9,53.7,39,75,null,6300,140,6900,9.6999999999999993,null,2017,9,null,null,null,null,null,null,null,10.541590909090909,13.086650433746245,7.9965313844355723,2.95,7.8355303030303025,8.0354704253415363,7.6355901807190687,6.5,13.161742424242423,43.810002340134545,-17.4865174916497,7,52.671969696969711,62.81683313153323,42.527106262406193,53.603816793893131,125.17443861875186,-17.966805030965602,95.717557251908403,195.19505952555048,-3.759945021733671,100,23,34.313708498984759,11.686291501015239,5893.5877862595416,8596.4199386799191,3190.7556338391637,432.76335877862596,1842.4404130773487,-976.91369552009689,6806.1068702290077,9445.3595536514258,4166.8541868065895,5000,10.090076335877868,29.113660302029061,-8.9335076302733256,null,null,43003,null,null,null,null,null,null,null,null,null,null,null,null,null,null,13.7,9.3000000000000007,89.95484108706691,7.82,5.9,53.7,39,75,"",6300,140,6900,9.6999999999999993]
[null,"15:2 Svalövsbäcken nedstr Svalöv","2017-10-31",7.3,11.1,92.35519803415157,7.75,31,46.3,48,99,null,7900,48,7200,13,null,2017,10,null,null,null,null,null,null,null,10.541590909090909,13.086650433746245,7.9965313844355723,2.95,7.8355303030303025,8.0354704253415363,7.6355901807190687,6.5,13.161742424242423,43.810002340134545,-17.4865174916497,7,52.671969696969711,62.81683313153323,42.527106262406193,53.603816793893131,125.17443861875186,-17.966805030965602,95.717557251908403,195.19505952555048,-3.759945021733671,100,23,34.313708498984759,11.686291501015239,5893.5877862595416,8596.4199386799191,3190.7556338391637,432.76335877862596,1842.4404130773487,-976.91369552009689,6806.1068702290077,9445.3595536514258,4166.8541868065895,5000,10.090076335877868,29.113660302029061,-8.9335076302733256,null,null,43039,null,null,null,null,null,null,null,null,null,null,null,null,null,null,7.3,11.1,92.35519803415157,7.75,31,46.3,48,99,"",7900,48,7200,13]
[null,"15:2 Svalövsbäcken nedstr Svalöv","2017-11-21",4.7,11.9,92.576354367371167,7.81,15,50.9,32,60,null,7000,160,7000,"<5",null,2017,11,null,null,null,null,null,null,null,10.541590909090909,13.086650433746245,7.9965313844355723,2.95,7.8355303030303025,8.0354704253415363,7.6355901807190687,6.5,13.161742424242423,43.810002340134545,-17.4865174916497,7,52.671969696969711,62.81683313153323,42.527106262406193,53.603816793893131,125.17443861875186,-17.966805030965602,95.717557251908403,195.19505952555048,-3.759945021733671,100,23,34.313708498984759,11.686291501015239,5893.5877862595416,8596.4199386799191,3190.7556338391637,432.76335877862596,1842.4404130773487,-976.91369552009689,6806.1068702290077,9445.3595536514258,4166.8541868065895,5000,10.090076335877868,29.113660302029061,-8.9335076302733256,null,null,43060,null,null,null,null,null,null,null,null,null,null,null,null,null,null,4.7,11.9,92.576354367371167,7.81,15,50.9,32,60,"",7000,160,7000,5]
[null,"15:2 Svalövsbäcken nedstr Svalöv","2017-12-28",5.4,11.1,87.959050272840429,7.73,21,43.9,39,72,null,5900,310,6300,10,null,2017,12,null,null,null,null,null,null,null,10.541590909090909,13.086650433746245,7.9965313844355723,2.95,7.8355303030303025,8.0354704253415363,7.6355901807190687,6.5,13.161742424242423,43.810002340134545,-17.4865174916497,7,52.671969696969711,62.81683313153323,42.527106262406193,53.603816793893131,125.17443861875186,-17.966805030965602,95.717557251908403,195.19505952555048,-3.759945021733671,100,23,34.313708498984759,11.686291501015239,5893.5877862595416,8596.4199386799191,3190.7556338391637,432.76335877862596,1842.4404130773487,-976.91369552009689,6806.1068702290077,9445.3595536514258,4166.8541868065895,5000,10.090076335877868,29.113660302029061,-8.9335076302733256,null,null,43097,null,null,null,null,null,null,null,null,null,null,null,null,null,null,5.4,11.1,87.959050272840429,7.73,21,43.9,39,72,"",5900,310,6300,10]
[null,"15:2 Svalövsbäcken nedstr Svalöv","2018-01-30",4.5,12.3,95,7.81,51,38.799999999999997,30,130,null,5100,120,5200,20,null,2018,1,null,null,null,null,null,null,null,10.541590909090909,13.086650433746245,7.9965313844355723,2.95,7.8355303030303025,8.0354704253415363,7.6355901807190687,6.5,13.161742424242423,43.810002340134545,-17.4865174916497,7,52.671969696969711,62.81683313153323,42.527106262406193,53.603816793893131,125.17443861875186,-17.966805030965602,95.717557251908403,195.19505952555048,-3.759945021733671,100,23,34.313708498984759,11.686291501015239,5893.5877862595416,8596.4199386799191,3190.7556338391637,432.76335877862596,1842.4404130773487,-976.91369552009689,6806.1068702290077,9445.3595536514258,4166.8541868065895,5000,10.090076335877868,29.113660302029061,-8.9335076302733256,null,null,43130,null,null,null,null,null,null,null,null,null,null,null,null,null,null,4.5,12.3,95,7.81,51,38.799999999999997,30,130,"",5100,120,5200,20]
[null,"15:2 Svalövsbäcken nedstr Svalöv","2018-02-28",0,14,96,7.89,5.8,54.1,23,46,null,4800,640,5100,"<5","is",2018,2,null,null,null,null,null,null,null,10.541590909090909,13.086650433746245,7.9965313844355723,2.95,7.8355303030303025,8.0354704253415363,7.6355901807190687,6.5,13.161742424242423,43.810002340134545,-17.4865174916497,7,52.671969696969711,62.81683313153323,42.527106262406193,53.603816793893131,125.17443861875186,-17.966805030965602,95.717557251908403,195.19505952555048,-3.759945021733671,100,23,34.313708498984759,11.686291501015239,5893.5877862595416,8596.4199386799191,3190.7556338391637,432.76335877862596,1842.4404130773487,-976.91369552009689,6806.1068702290077,9445.3595536514258,4166.8541868065895,5000,10.090076335877868,29.113660302029061,-8.9335076302733256,null,null,43159,null,null,null,null,null,null,null,null,null,null,null,null,null,null,0,14,96,7.89,5.8,54.1,23,46,"",4800,640,5100,5]
[null,"15:2 Svalövsbäcken nedstr Svalöv","2018-03-27",3,12.3,91,7.84,7.1,44.6,20,44,null,3800,270,4400,6.5,null,2018,3,null,null,null,null,null,null,null,10.541590909090909,13.086650433746245,7.9965313844355723,2.95,7.8355303030303025,8.0354704253415363,7.6355901807190687,6.5,13.161742424242423,43.810002340134545,-17.4865174916497,7,52.671969696969711,62.81683313153323,42.527106262406193,53.603816793893131,125.17443861875186,-17.966805030965602,95.717557251908403,195.19505952555048,-3.759945021733671,100,23,34.313708498984759,11.686291501015239,5893.5877862595416,8596.4199386799191,3190.7556338391637,432.76335877862596,1842.4404130773487,-976.91369552009689,6806.1068702290077,9445.3595536514258,4166.8541868065895,5000,10.090076335877868,29.113660302029061,-8.9335076302733256,null,null,43186,null,null,null,null,null,null,null,null,null,null,null,null,null,null,3,12.3,91,7.84,7.1,44.6,20,44,"",3800,270,4400,6.5]
[null,"15:2 Svalövsbäcken nedstr Svalöv","2018-04-25",9.5,9.6,84,7.78,3.3,52.5,3.2,29,null,3500,360,3800,"<5",null,2018,4,null,null,null,null,null,null,null,10.541590909090909,13.086650433746245,7.9965313844355723,2.95,7.8355303030303025,8.0354704253415363,7.6355901807190687,6.5,13.161742424242423,43.810002340134545,-17.4865174916497,7,52.671969696969711,62.81683313153323,42.527106262406193,53.603816793893131,125.17443861875186,-17.966805030965602,95.717557251908403,195.19505952555048,-3.759945021733671,100,23,34.313708498984759,11.686291501015239,5893.5877862595416,8596.4199386799191,3190.7556338391637,432.76335877862596,1842.4404130773487,-976.91369552009689,6806.1068702290077,9445.3595536514258,4166.8541868065895,5000,10.090076335877868,29.113660302029061,-8.9335076302733256,null,null,43215,null,null,null,null,null,null,null,null,null,null,null,null,null,null,9.5,9.6,84,7.78,3.3,52.5,3.2,29,"",3500,360,3800,5]
[null,"15:2 Svalövsbäcken nedstr Svalöv","2018-05-29",16.100000000000001,8.3000000000000007,84,7.74,8,62.6,45,86,null,3800,200,4200,7,null,2018,5,null,null,null,null,null,null,null,10.541590909090909,13.086650433746245,7.9965313844355723,2.95,7.8355303030303025,8.0354704253415363,7.6355901807190687,6.5,13.161742424242423,43.810002340134545,-17.4865174916497,7,52.671969696969711,62.81683313153323,42.527106262406193,53.603816793893131,125.17443861875186,-17.966805030965602,95.717557251908403,195.19505952555048,-3.759945021733671,100,23,34.313708498984759,11.686291501015239,5893.5877862595416,8596.4199386799191,3190.7556338391637,432.76335877862596,1842.4404130773487,-976.91369552009689,6806.1068702290077,9445.3595536514258,4166.8541868065895,5000,10.090076335877868,29.113660302029061,-8.9335076302733256,null,null,43249,null,null,null,null,null,null,null,null,null,null,null,null,null,null,16.100000000000001,8.3000000000000007,84,7.74,8,62.6,45,86,"",3800,200,4200,7]
[null,"15:2 Svalövsbäcken nedstr Svalöv","2018-06-18",15,7.4,74,7.66,2.6,55.9,null,null,null,null,null,null,null,"Proverna försvunna ",2018,6,null,null,null,null,null,null,null,10.541590909090909,13.086650433746245,7.9965313844355723,2.95,7.8355303030303025,8.0354704253415363,7.6355901807190687,6.5,13.161742424242423,43.810002340134545,-17.4865174916497,7,52.671969696969711,62.81683313153323,42.527106262406193,53.603816793893131,125.17443861875186,-17.966805030965602,95.717557251908403,195.19505952555048,-3.759945021733671,100,23,34.313708498984759,11.686291501015239,5893.5877862595416,8596.4199386799191,3190.7556338391637,432.76335877862596,1842.4404130773487,-976.91369552009689,6806.1068702290077,9445.3595536514258,4166.8541868065895,5000,10.090076335877868,29.113660302029061,-8.9335076302733256,null,null,43269,null,null,null,null,null,null,null,null,null,null,null,null,null,null,15,7.4,74,7.66,2.6,55.9,"","","","","","",""]
[null,"15:2 Svalövsbäcken nedstr Svalöv","2018-07-16",19.100000000000001,2.1,23,7.68,6.6,88.1,120,250,null,"<10",10000,13000,7.5,null,2018,7,null,null,null,null,null,null,null,10.541590909090909,13.086650433746245,7.9965313844355723,2.95,7.8355303030303025,8.0354704253415363,7.6355901807190687,6.5,13.161742424242423,43.810002340134545,-17.4865174916497,7,52.671969696969711,62.81683313153323,42.527106262406193,53.603816793893131,125.17443861875186,-17.966805030965602,95.717557251908403,195.19505952555048,-3.759945021733671,100,23,34.313708498984759,11.686291501015239,5893.5877862595416,8596.4199386799191,3190.7556338391637,432.76335877862596,1842.4404130773487,-976.91369552009689,6806.1068702290077,9445.3595536514258,4166.8541868065895,5000,10.090076335877868,29.113660302029061,-8.9335076302733256,null,null,43297,null,null,null,null,null,null,null,null,null,null,null,null,null,null,19.100000000000001,2.1,23,7.68,6.6,88.1,120,250,"",10,10000,13000,7.5]
[null,"15:2 Svalövsbäcken nedstr Svalöv","2018-08-28",15.2,4.4000000000000004,44,7.41,1.9,38.5,81,110,null,4000,330,4600,"<5",null,2018,8,null,null,null,null,null,null,null,10.541590909090909,13.086650433746245,7.9965313844355723,2.95,7.8355303030303025,8.0354704253415363,7.6355901807190687,6.5,13.161742424242423,43.810002340134545,-17.4865174916497,7,52.671969696969711,62.81683313153323,42.527106262406193,53.603816793893131,125.17443861875186,-17.966805030965602,95.717557251908403,195.19505952555048,-3.759945021733671,100,23,34.313708498984759,11.686291501015239,5893.5877862595416,8596.4199386799191,3190.7556338391637,432.76335877862596,1842.4404130773487,-976.91369552009689,6806.1068702290077,9445.3595536514258,4166.8541868065895,5000,10.090076335877868,29.113660302029061,-8.9335076302733256,null,null,43340,null,null,null,null,null,null,null,null,null,null,null,null,null,null,15.2,4.4000000000000004,44,7.41,1.9,38.5,81,110,"",4000,330,4600,5]
[null,"15:2 Svalövsbäcken nedstr Svalöv","2018-10-30",8.3000000000000007,10.4,89,7.88,2.1,67.599999999999994,51,76,null,7000,200,7100,"<5",null,2018,10,null,null,null,null,null,null,null,10.541590909090909,13.086650433746245,7.9965313844355723,2.95,7.8355303030303025,8.0354704253415363,7.6355901807190687,6.5,13.161742424242423,43.810002340134545,-17.4865174916497,7,52.671969696969711,62.81683313153323,42.527106262406193,53.603816793893131,125.17443861875186,-17.966805030965602,95.717557251908403,195.19505952555048,-3.759945021733671,100,23,34.313708498984759,11.686291501015239,5893.5877862595416,8596.4199386799191,3190.7556338391637,432.76335877862596,1842.4404130773487,-976.91369552009689,6806.1068702290077,9445.3595536514258,4166.8541868065895,5000,10.090076335877868,29.113660302029061,-8.9335076302733256,null,null,43403,null,null,null,null,null,null,null,null,null,null,null,null,null,null,8.3000000000000007,10.4,89,7.88,2.1,67.599999999999994,51,76,"",7000,200,7100,5]
[null,"15:2 Svalövsbäcken nedstr Svalöv","2018-11-27",0.8,9.5,66,7.6,3.7,72.3,160,210,null,7900,3700,10000,"<5",null,2018,11,null,null,null,null,null,null,null,10.541590909090909,13.086650433746245,7.9965313844355723,2.95,7.8355303030303025,8.0354704253415363,7.6355901807190687,6.5,13.161742424242423,43.810002340134545,-17.4865174916497,7,52.671969696969711,62.81683313153323,42.527106262406193,53.603816793893131,125.17443861875186,-17.966805030965602,95.717557251908403,195.19505952555048,-3.759945021733671,100,23,34.313708498984759,11.686291501015239,5893.5877862595416,8596.4199386799191,3190.7556338391637,432.76335877862596,1842.4404130773487,-976.91369552009689,6806.1068702290077,9445.3595536514258,4166.8541868065895,5000,10.090076335877868,29.113660302029061,-8.9335076302733256,null,null,43431,null,null,null,null,null,null,null,null,null,null,null,null,null,null,0.8,9.5,66,7.6,3.7,72.3,160,210,"",7900,3700,10000,5]
[null,"15:2 Svalövsbäcken nedstr Svalöv","2018-12-20",4.5,10.9,84,7.59,5.5,66.5,25,48,null,15000,680,14000,"<5",null,2018,12,null,null,null,null,null,null,null,10.541590909090909,13.086650433746245,7.9965313844355723,2.95,7.8355303030303025,8.0354704253415363,7.6355901807190687,6.5,13.161742424242423,43.810002340134545,-17.4865174916497,7,52.671969696969711,62.81683313153323,42.527106262406193,53.603816793893131,125.17443861875186,-17.966805030965602,95.717557251908403,195.19505952555048,-3.759945021733671,100,23,34.313708498984759,11.686291501015239,5893.5877862595416,8596.4199386799191,3190.7556338391637,432.76335877862596,1842.4404130773487,-976.91369552009689,6806.1068702290077,9445.3595536514258,4166.8541868065895,5000,10.090076335877868,29.113660302029061,-8.9335076302733256,null,null,43454,null,null,null,null,null,null,null,null,null,null,null,null,null,null,4.5,10.9,84,7.59,5.5,66.5,25,48,"",15000,680,14000,5]
[null,"15:2 Svalövsbäcken nedstr Svalöv","2019-01-29",2.6,12.5,92,7.68,8.6999999999999993,58,28,53,null,14000,170,14000,7.5,null,2019,1,null,null,null,null,null,null,null,10.541590909090909,13.086650433746245,7.9965313844355723,2.95,7.8355303030303025,8.0354704253415363,7.6355901807190687,6.5,13.161742424242423,43.810002340134545,-17.4865174916497,7,52.671969696969711,62.81683313153323,42.527106262406193,53.603816793893131,125.17443861875186,-17.966805030965602,95.717557251908403,195.19505952555048,-3.759945021733671,100,23,34.313708498984759,11.686291501015239,5893.5877862595416,8596.4199386799191,3190.7556338391637,432.76335877862596,1842.4404130773487,-976.91369552009689,6806.1068702290077,9445.3595536514258,4166.8541868065895,5000,10.090076335877868,29.113660302029061,-8.9335076302733256,null,null,43494,null,null,null,null,null,null,null,null,null,null,null,null,null,null,2.6,12.5,92,7.68,8.6999999999999993,58,28,53,"",14000,170,14000,7.5]
[null,"15:2 Svalövsbäcken nedstr Svalöv","2019-02-26",6.4,13,106,7.89,4.5,52.9,20,33,null,13000,250,14000,"<5",null,2019,2,null,null,null,null,null,null,null,10.541590909090909,13.086650433746245,7.9965313844355723,2.95,7.8355303030303025,8.0354704253415363,7.6355901807190687,6.5,13.161742424242423,43.810002340134545,-17.4865174916497,7,52.671969696969711,62.81683313153323,42.527106262406193,53.603816793893131,125.17443861875186,-17.966805030965602,95.717557251908403,195.19505952555048,-3.759945021733671,100,23,34.313708498984759,11.686291501015239,5893.5877862595416,8596.4199386799191,3190.7556338391637,432.76335877862596,1842.4404130773487,-976.91369552009689,6806.1068702290077,9445.3595536514258,4166.8541868065895,5000,10.090076335877868,29.113660302029061,-8.9335076302733256,null,null,43522,null,null,null,null,null,null,null,null,null,null,null,null,null,null,6.4,13,106,7.89,4.5,52.9,20,33,"",13000,250,14000,5]
[null,"15:2 Svalövsbäcken nedstr Svalöv","2019-03-26",8.1,11.4,97,7.95,4.4000000000000004,46.6,18,36,null,7400,560,8000,"<5",null,2019,3,null,null,null,null,null,null,null,10.541590909090909,13.086650433746245,7.9965313844355723,2.95,7.8355303030303025,8.0354704253415363,7.6355901807190687,6.5,13.161742424242423,43.810002340134545,-17.4865174916497,7,52.671969696969711,62.81683313153323,42.527106262406193,53.603816793893131,125.17443861875186,-17.966805030965602,95.717557251908403,195.19505952555048,-3.759945021733671,100,23,34.313708498984759,11.686291501015239,5893.5877862595416,8596.4199386799191,3190.7556338391637,432.76335877862596,1842.4404130773487,-976.91369552009689,6806.1068702290077,9445.3595536514258,4166.8541868065895,5000,10.090076335877868,29.113660302029061,-8.9335076302733256,null,null,43550,null,null,null,null,null,null,null,null,null,null,null,null,null,null,8.1,11.4,97,7.95,4.4000000000000004,46.6,18,36,"",7400,560,8000,5]
[null,"15:2 Svalövsbäcken nedstr Svalöv","2019-04-23",12.2,11,103,8.44,1.4,52.6,"<2",29,null,5300,130,5400,"<5",null,2019,4,null,null,null,null,null,null,null,10.541590909090909,13.086650433746245,7.9965313844355723,2.95,7.8355303030303025,8.0354704253415363,7.6355901807190687,6.5,13.161742424242423,43.810002340134545,-17.4865174916497,7,52.671969696969711,62.81683313153323,42.527106262406193,53.603816793893131,125.17443861875186,-17.966805030965602,95.717557251908403,195.19505952555048,-3.759945021733671,100,23,34.313708498984759,11.686291501015239,5893.5877862595416,8596.4199386799191,3190.7556338391637,432.76335877862596,1842.4404130773487,-976.91369552009689,6806.1068702290077,9445.3595536514258,4166.8541868065895,5000,10.090076335877868,29.113660302029061,-8.9335076302733256,null,null,43578,null,null,null,null,null,null,null,null,null,null,null,null,null,null,12.2,11,103,8.44,1.4,52.6,2,29,"",5300,130,5400,5]
[null,"15:2 Svalövsbäcken nedstr Svalöv","2019-05-27",13.5,7.3,70,7.82,1.2,58.4,83,120,null,6300,870,7300,"<5",null,2019,5,null,null,null,null,null,null,null,10.541590909090909,13.086650433746245,7.9965313844355723,2.95,7.8355303030303025,8.0354704253415363,7.6355901807190687,6.5,13.161742424242423,43.810002340134545,-17.4865174916497,7,52.671969696969711,62.81683313153323,42.527106262406193,53.603816793893131,125.17443861875186,-17.966805030965602,95.717557251908403,195.19505952555048,-3.759945021733671,100,23,34.313708498984759,11.686291501015239,5893.5877862595416,8596.4199386799191,3190.7556338391637,432.76335877862596,1842.4404130773487,-976.91369552009689,6806.1068702290077,9445.3595536514258,4166.8541868065895,5000,10.090076335877868,29.113660302029061,-8.9335076302733256,null,null,43612,null,null,null,null,null,null,null,null,null,null,null,null,null,null,13.5,7.3,70,7.82,1.2,58.4,83,120,"",6300,870,7300,5]
[null,"15:2 Svalövsbäcken nedstr Svalöv","2019-06-24",17.399999999999999,12.8,134,8.3800000000000008,1.25,62.25,74,100,null,7800,21,8500,"<5",null,2019,6,null,null,null,null,null,null,null,10.541590909090909,13.086650433746245,7.9965313844355723,2.95,7.8355303030303025,8.0354704253415363,7.6355901807190687,6.5,13.161742424242423,43.810002340134545,-17.4865174916497,7,52.671969696969711,62.81683313153323,42.527106262406193,53.603816793893131,125.17443861875186,-17.966805030965602,95.717557251908403,195.19505952555048,-3.759945021733671,100,23,34.313708498984759,11.686291501015239,5893.5877862595416,8596.4199386799191,3190.7556338391637,432.76335877862596,1842.4404130773487,-976.91369552009689,6806.1068702290077,9445.3595536514258,4166.8541868065895,5000,10.090076335877868,29.113660302029061,-8.9335076302733256,null,null,43640,null,null,null,null,null,null,null,null,null,null,null,null,null,null,17.399999999999999,12.8,134,8.3800000000000008,1.25,62.25,74,100,"",7800,21,8500,5]
[null,"15:2 Svalövsbäcken nedstr Svalöv","2019-07-22",17.100000000000001,9.6999999999999993,101,7.86,1.3,54.9,210,340,null,4700,87,5200,9.8000000000000007,null,2019,7,null,null,null,null,null,null,null,10.541590909090909,13.086650433746245,7.9965313844355723,2.95,7.8355303030303025,8.0354704253415363,7.6355901807190687,6.5,13.161742424242423,43.810002340134545,-17.4865174916497,7,52.671969696969711,62.81683313153323,42.527106262406193,53.603816793893131,125.17443861875186,-17.966805030965602,95.717557251908403,195.19505952555048,-3.759945021733671,100,23,34.313708498984759,11.686291501015239,5893.5877862595416,8596.4199386799191,3190.7556338391637,432.76335877862596,1842.4404130773487,-976.91369552009689,6806.1068702290077,9445.3595536514258,4166.8541868065895,5000,10.090076335877868,29.113660302029061,-8.9335076302733256,null,null,43668,null,null,null,null,null,null,null,null,null,null,null,null,null,null,17.100000000000001,9.6999999999999993,101,7.86,1.3,54.9,210,340,"",4700,87,5200,9.8000000000000007]
[null,"15:2 Svalövsbäcken nedstr Svalöv","2019-08-27",21.1,3.8,43,7.65,6.8,81.400000000000006,260,620,null,350,12000,15000,11,null,2019,8,null,null,null,null,null,null,null,10.541590909090909,13.086650433746245,7.9965313844355723,2.95,7.8355303030303025,8.0354704253415363,7.6355901807190687,6.5,13.161742424242423,43.810002340134545,-17.4865174916497,7,52.671969696969711,62.81683313153323,42.527106262406193,53.603816793893131,125.17443861875186,-17.966805030965602,95.717557251908403,195.19505952555048,-3.759945021733671,100,23,34.313708498984759,11.686291501015239,5893.5877862595416,8596.4199386799191,3190.7556338391637,432.76335877862596,1842.4404130773487,-976.91369552009689,6806.1068702290077,9445.3595536514258,4166.8541868065895,5000,10.090076335877868,29.113660302029061,-8.9335076302733256,null,null,43704,null,null,null,null,null,null,null,null,null,null,null,null,null,null,21.1,3.8,43,7.65,6.8,81.400000000000006,260,620,"",350,12000,15000,11]
[null,"15:2 Svalövsbäcken nedstr Svalöv","2019-09-25",9.8000000000000007,8.4,74,7.52,5.0999999999999996,38.5,98,130,null,3200,110,4100,"<5",null,2019,9,null,null,null,null,null,null,null,10.541590909090909,13.086650433746245,7.9965313844355723,2.95,7.8355303030303025,8.0354704253415363,7.6355901807190687,6.5,13.161742424242423,43.810002340134545,-17.4865174916497,7,52.671969696969711,62.81683313153323,42.527106262406193,53.603816793893131,125.17443861875186,-17.966805030965602,95.717557251908403,195.19505952555048,-3.759945021733671,100,23,34.313708498984759,11.686291501015239,5893.5877862595416,8596.4199386799191,3190.7556338391637,432.76335877862596,1842.4404130773487,-976.91369552009689,6806.1068702290077,9445.3595536514258,4166.8541868065895,5000,10.090076335877868,29.113660302029061,-8.9335076302733256,null,null,43733,null,null,null,null,null,null,null,null,null,null,null,null,null,null,9.8000000000000007,8.4,74,7.52,5.0999999999999996,38.5,98,130,"",3200,110,4100,5]
[null,"15:2 Svalövsbäcken nedstr Svalöv","2019-09-26",13.3,5.8,56,7.65,1,68.7,150,190,null,9200,250,9200,"<5",null,2019,9,null,null,null,null,null,null,null,10.541590909090909,13.086650433746245,7.9965313844355723,2.95,7.8355303030303025,8.0354704253415363,7.6355901807190687,6.5,13.161742424242423,43.810002340134545,-17.4865174916497,7,52.671969696969711,62.81683313153323,42.527106262406193,53.603816793893131,125.17443861875186,-17.966805030965602,95.717557251908403,195.19505952555048,-3.759945021733671,100,23,34.313708498984759,11.686291501015239,5893.5877862595416,8596.4199386799191,3190.7556338391637,432.76335877862596,1842.4404130773487,-976.91369552009689,6806.1068702290077,9445.3595536514258,4166.8541868065895,5000,10.090076335877868,29.113660302029061,-8.9335076302733256,null,null,43734,null,null,null,null,null,null,null,null,null,null,null,null,null,null,13.3,5.8,56,7.65,1,68.7,150,190,"",9200,250,9200,5]
[null,"15:2 Svalövsbäcken nedstr Svalöv","2019-10-21",11.6,10,92,7.74,13,52.5,36,83,null,11000,95,11000,6.8,null,2019,10,null,null,null,null,null,null,null,10.541590909090909,13.086650433746245,7.9965313844355723,2.95,7.8355303030303025,8.0354704253415363,7.6355901807190687,6.5,13.161742424242423,43.810002340134545,-17.4865174916497,7,52.671969696969711,62.81683313153323,42.527106262406193,53.603816793893131,125.17443861875186,-17.966805030965602,95.717557251908403,195.19505952555048,-3.759945021733671,100,23,34.313708498984759,11.686291501015239,5893.5877862595416,8596.4199386799191,3190.7556338391637,432.76335877862596,1842.4404130773487,-976.91369552009689,6806.1068702290077,9445.3595536514258,4166.8541868065895,5000,10.090076335877868,29.113660302029061,-8.9335076302733256,null,null,43759,null,null,null,null,null,null,null,null,null,null,null,null,null,null,11.6,10,92,7.74,13,52.5,36,83,"",11000,95,11000,6.8]
[null,"15:2 Svalövsbäcken nedstr Svalöv","2019-11-25",7.3,11.5,96,7.93,7.2,54.6,29,59,31,8400,150,9400,7.2,null,2019,11,null,null,null,null,null,null,null,10.541590909090909,13.086650433746245,7.9965313844355723,2.95,7.8355303030303025,8.0354704253415363,7.6355901807190687,6.5,13.161742424242423,43.810002340134545,-17.4865174916497,7,52.671969696969711,62.81683313153323,42.527106262406193,53.603816793893131,125.17443861875186,-17.966805030965602,95.717557251908403,195.19505952555048,-3.759945021733671,100,23,34.313708498984759,11.686291501015239,5893.5877862595416,8596.4199386799191,3190.7556338391637,432.76335877862596,1842.4404130773487,-976.91369552009689,6806.1068702290077,9445.3595536514258,4166.8541868065895,5000,10.090076335877868,29.113660302029061,-8.9335076302733256,null,null,43794,null,null,null,null,null,null,null,null,null,null,null,null,null,null,7.3,11.5,96,7.93,7.2,54.6,29,59,31,8400,150,9400,7.2]
[null,"15:2 Svalövsbäcken nedstr Svalöv","2019-12-19",6,11.9,96,7.66,10.3,47,14,65,null,9100,90,10000,11,null,2019,12,null,null,null,null,null,null,null,10.541590909090909,13.086650433746245,7.9965313844355723,2.95,7.8355303030303025,8.0354704253415363,7.6355901807190687,6.5,13.161742424242423,43.810002340134545,-17.4865174916497,7,52.671969696969711,62.81683313153323,42.527106262406193,53.603816793893131,125.17443861875186,-17.966805030965602,95.717557251908403,195.19505952555048,-3.759945021733671,100,23,34.313708498984759,11.686291501015239,5893.5877862595416,8596.4199386799191,3190.7556338391637,432.76335877862596,1842.4404130773487,-976.91369552009689,6806.1068702290077,9445.3595536514258,4166.8541868065895,5000,10.090076335877868,29.113660302029061,-8.9335076302733256,null,null,43818,null,null,null,null,null,null,null,null,null,null,null,null,null,null,6,11.9,96,7.66,10.3,47,14,65,"",9100,90,10000,11]
[null,"15:2 Svalövsbäcken nedstr Svalöv","2020-01-27",5.5,11.6,92,7.99,6.5,51.1,30,50,"",7600,310,7600,5.9,"Resultatet av kväve total, N, är mindre än summan av ammoniumkväve, NH4-N, och nitrat + nitritkväve, NO23-N. Skillnaden ligger dock inommätosäkerheten.",2020,1,null,null,null,null,null,null,null,10.541590909090909,13.086650433746245,7.9965313844355723,2.95,7.8355303030303025,8.0354704253415363,7.6355901807190687,6.5,13.161742424242423,43.810002340134545,-17.4865174916497,7,52.671969696969711,62.81683313153323,42.527106262406193,53.603816793893131,125.17443861875186,-17.966805030965602,95.717557251908403,195.19505952555048,-3.759945021733671,100,23,34.313708498984759,11.686291501015239,5893.5877862595416,8596.4199386799191,3190.7556338391637,432.76335877862596,1842.4404130773487,-976.91369552009689,6806.1068702290077,9445.3595536514258,4166.8541868065895,5000,10.090076335877868,29.113660302029061,-8.9335076302733256,null,null,43857,null,null,null,null,null,null,null,null,null,null,null,null,null,null,5.5,11.6,92,7.99,6.5,51.1,30,50,"",7600,310,7600,5.9]
[null,"15:2 Svalövsbäcken nedstr Svalöv","2020-02-25",5.5,11.2,89,7.7,40,37.9,32,96,"",6400,25,6700,15,"Värden från Synlab korr. 12/5 -20, se kommentarsflik",2020,2,null,null,null,null,null,null,null,10.541590909090909,13.086650433746245,7.9965313844355723,2.95,7.8355303030303025,8.0354704253415363,7.6355901807190687,6.5,13.161742424242423,43.810002340134545,-17.4865174916497,7,52.671969696969711,62.81683313153323,42.527106262406193,53.603816793893131,125.17443861875186,-17.966805030965602,95.717557251908403,195.19505952555048,-3.759945021733671,100,23,34.313708498984759,11.686291501015239,5893.5877862595416,8596.4199386799191,3190.7556338391637,432.76335877862596,1842.4404130773487,-976.91369552009689,6806.1068702290077,9445.3595536514258,4166.8541868065895,5000,10.090076335877868,29.113660302029061,-8.9335076302733256,null,null,43886,null,null,null,null,null,null,null,null,null,null,null,null,null,null,5.5,11.2,89,7.7,40,37.9,32,96,"",6400,25,6700,15]
[null,"15:2 Svalövsbäcken nedstr Svalöv","2020-03-24",5.7,13.9,111,8.1199999999999992,4,48.6,15,38,"",5700,270,5300,3.2,"Resultatet av kväve total, N, är mindre än summan av ammoniumkväve, NH4-N, och nitrat +nitritkväve, NO23-N. Skillnaden ligger dock inom mätosäkerheten.",2020,3,null,null,null,null,null,null,null,10.541590909090909,13.086650433746245,7.9965313844355723,2.95,7.8355303030303025,8.0354704253415363,7.6355901807190687,6.5,13.161742424242423,43.810002340134545,-17.4865174916497,7,52.671969696969711,62.81683313153323,42.527106262406193,53.603816793893131,125.17443861875186,-17.966805030965602,95.717557251908403,195.19505952555048,-3.759945021733671,100,23,34.313708498984759,11.686291501015239,5893.5877862595416,8596.4199386799191,3190.7556338391637,432.76335877862596,1842.4404130773487,-976.91369552009689,6806.1068702290077,9445.3595536514258,4166.8541868065895,5000,10.090076335877868,29.113660302029061,-8.9335076302733256,null,null,43914,null,null,null,null,null,null,null,null,null,null,null,null,null,null,5.7,13.9,111,8.1199999999999992,4,48.6,15,38,"",5700,270,5300,3.2]
[null,"15:2 Svalövsbäcken nedstr Svalöv","2020-04-21",10.6,16.3,147,8.3800000000000008,2,56.7,12,40,"",4200,240,4900,"<2","",2020,4,null,null,null,null,null,null,null,10.541590909090909,13.086650433746245,7.9965313844355723,2.95,7.8355303030303025,8.0354704253415363,7.6355901807190687,6.5,13.161742424242423,43.810002340134545,-17.4865174916497,7,52.671969696969711,62.81683313153323,42.527106262406193,53.603816793893131,125.17443861875186,-17.966805030965602,95.717557251908403,195.19505952555048,-3.759945021733671,100,23,34.313708498984759,11.686291501015239,5893.5877862595416,8596.4199386799191,3190.7556338391637,432.76335877862596,1842.4404130773487,-976.91369552009689,6806.1068702290077,9445.3595536514258,4166.8541868065895,5000,10.090076335877868,29.113660302029061,-8.9335076302733256,null,null,43942,null,null,null,null,null,null,null,null,null,null,null,null,null,null,10.6,16.3,147,8.3800000000000008,2,56.7,12,40,"",4200,240,4900,2]
[null,"15:2 Svalövsbäcken nedstr Svalöv","2020-05-26",16.3,15.9,163,8.51,1.7,59.3,12,60,"",4000,13,4400,4.2,"",2020,5,null,null,null,null,null,null,null,10.541590909090909,13.086650433746245,7.9965313844355723,2.95,7.8355303030303025,8.0354704253415363,7.6355901807190687,6.5,13.161742424242423,43.810002340134545,-17.4865174916497,7,52.671969696969711,62.81683313153323,42.527106262406193,53.603816793893131,125.17443861875186,-17.966805030965602,95.717557251908403,195.19505952555048,-3.759945021733671,100,23,34.313708498984759,11.686291501015239,5893.5877862595416,8596.4199386799191,3190.7556338391637,432.76335877862596,1842.4404130773487,-976.91369552009689,6806.1068702290077,9445.3595536514258,4166.8541868065895,5000,10.090076335877868,29.113660302029061,-8.9335076302733256,null,null,43977,null,null,null,null,null,null,null,null,null,null,null,null,null,null,16.3,15.9,163,8.51,1.7,59.3,12,60,"",4000,13,4400,4.2]
[null,"15:2 Svalövsbäcken nedstr Svalöv","2020-06-23",16.3,6.4,65,7.64,1.8,64.8,190,210,"",6200,230,6300,2.4,"Resultatet av kväve total, N, är mindre än summan av ammoniumkväve, NH4-N, och nitrat +nitritkväve, NO23-N. Skillnaden ligger dock inom mätosäkerheten.",2020,6,null,null,null,null,null,null,null,10.541590909090909,13.086650433746245,7.9965313844355723,2.95,7.8355303030303025,8.0354704253415363,7.6355901807190687,6.5,13.161742424242423,43.810002340134545,-17.4865174916497,7,52.671969696969711,62.81683313153323,42.527106262406193,53.603816793893131,125.17443861875186,-17.966805030965602,95.717557251908403,195.19505952555048,-3.759945021733671,100,23,34.313708498984759,11.686291501015239,5893.5877862595416,8596.4199386799191,3190.7556338391637,432.76335877862596,1842.4404130773487,-976.91369552009689,6806.1068702290077,9445.3595536514258,4166.8541868065895,5000,10.090076335877868,29.113660302029061,-8.9335076302733256,null,null,44005,null,null,null,null,null,null,null,null,null,null,null,null,null,null,16.3,6.4,65,7.64,1.8,64.8,190,210,"",6200,230,6300,2.4]
[null,"15:2 Svalövsbäcken nedstr Svalöv","2020-07-21",15.2,10.1,101,7.92,2,70.3,140,180,"",8700,150,8900,"<2","",2020,7,null,null,null,null,null,null,null,10.541590909090909,13.086650433746245,7.9965313844355723,2.95,7.8355303030303025,8.0354704253415363,7.6355901807190687,6.5,13.161742424242423,43.810002340134545,-17.4865174916497,7,52.671969696969711,62.81683313153323,42.527106262406193,53.603816793893131,125.17443861875186,-17.966805030965602,95.717557251908403,195.19505952555048,-3.759945021733671,100,23,34.313708498984759,11.686291501015239,5893.5877862595416,8596.4199386799191,3190.7556338391637,432.76335877862596,1842.4404130773487,-976.91369552009689,6806.1068702290077,9445.3595536514258,4166.8541868065895,5000,10.090076335877868,29.113660302029061,-8.9335076302733256,null,null,44033,null,null,null,null,null,null,null,null,null,null,null,null,null,null,15.2,10.1,101,7.92,2,70.3,140,180,"",8700,150,8900,2]
[null,"15:2 Svalövsbäcken nedstr Svalöv","2020-08-18",17.8,5.0999999999999996,54,7.67,1.7,75.2,390,420,"",6300,2500,9800,2.4,"",2020,8,null,null,null,null,null,null,null,10.541590909090909,13.086650433746245,7.9965313844355723,2.95,7.8355303030303025,8.0354704253415363,7.6355901807190687,6.5,13.161742424242423,43.810002340134545,-17.4865174916497,7,52.671969696969711,62.81683313153323,42.527106262406193,53.603816793893131,125.17443861875186,-17.966805030965602,95.717557251908403,195.19505952555048,-3.759945021733671,100,23,34.313708498984759,11.686291501015239,5893.5877862595416,8596.4199386799191,3190.7556338391637,432.76335877862596,1842.4404130773487,-976.91369552009689,6806.1068702290077,9445.3595536514258,4166.8541868065895,5000,10.090076335877868,29.113660302029061,-8.9335076302733256,null,null,44061,null,null,null,null,null,null,null,null,null,null,null,null,null,null,17.8,5.0999999999999996,54,7.67,1.7,75.2,390,420,"",6300,2500,9800,2.4]
[null,"15:2 Svalövsbäcken nedstr Svalöv","2020-09-21",14.4,6.8,67,7.66,1.3,74.5,470,490,"",12000,1500,13000,2.4,"Resultatet av kväve total, N, är mindre än summanav ammoniumkväve, NH4-N, och nitrat + nitritkväve, NO23-N. Skillnaden ligger dock inommätosäkerheten.",2020,9,null,null,null,null,null,null,null,{"$f":"$E$145","v":10.541590909090909},{"$f":"AA138+E$146","v":13.086650433746245},{"$f":"AA138-E$146","v":7.9965313844355723},2.95,{"$f":"$G$145","v":7.8355303030303025},{"$f":"AE138+G$146","v":8.0354704253415363},{"$f":"AE138-G$146","v":7.6355901807190687},6.5,{"$f":"$H$145","v":13.161742424242423},{"$f":"AI138+H$146","v":43.810002340134545},{"$f":"AI138-H$146","v":-17.4865174916497},7,{"$f":"$I$145","v":52.671969696969711},{"$f":"AM138+I$146","v":62.81683313153323},{"$f":"AM138-I$146","v":42.527106262406193},{"$f":"$J$145","v":53.603816793893131},{"$f":"AP138+J$146","v":125.17443861875186},{"$f":"AP138-J$146","v":-17.966805030965602},{"$f":"$K$145","v":95.717557251908403},{"$f":"AS138+$K$146","v":195.19505952555048},{"$f":"AS138-$K$146","v":-3.759945021733671},100,{"$f":"$L$145","v":23},{"$f":"AW138+$L$146","v":34.313708498984759},{"$f":"AW138-$L$146","v":11.686291501015239},{"$f":"$M$145","v":5893.5877862595416},{"$f":"AZ138+$M$146","v":8596.4199386799191},{"$f":"AZ138-$M$146","v":3190.7556338391637},{"$f":"$N$145","v":432.76335877862596},{"$f":"BC138+$N$146","v":1842.4404130773487},{"$f":"BC138-$N$146","v":-976.91369552009689},{"$f":"$O$145","v":6806.1068702290077},{"$f":"BF138+$O$146","v":9445.3595536514258},{"$f":"BF138-$O$146","v":4166.8541868065895},5000,{"$f":"$P$145","v":10.090076335877868},{"$f":"BJ138+$P$146","v":29.113660302029061},{"$f":"BJ138-$P$146","v":-8.9335076302733256},null,null,{"$f":"C138","v":44095},null,null,null,null,null,null,null,null,null,null,null,null,null,null,{"$f":"IF(D138=\"\",\"\",IF(OR(LEFT(D138,1)=\"<\",LEFT(D138,1)=\">\"),VALUE(MID(D138,2,3)),D138))","v":14.4},{"$f":"IF(E138=\"\",\"\",IF(OR(LEFT(E138,1)=\"<\",LEFT(E138,1)=\">\"),VALUE(MID(E138,2,3)),E138))","v":6.8},{"$f":"IF(F138=\"\",\"\",IF(OR(LEFT(F138,1)=\"<\",LEFT(F138,1)=\">\"),VALUE(MID(F138,2,3)),F138))","v":67},{"$f":"IF(G138=\"\",\"\",IF(OR(LEFT(G138,1)=\"<\",LEFT(G138,1)=\">\"),VALUE(MID(G138,2,3)),G138))","v":7.66},{"$f":"IF(H138=\"\",\"\",IF(OR(LEFT(H138,1)=\"<\",LEFT(H138,1)=\">\"),VALUE(MID(H138,2,3)),H138))","v":1.3},{"$f":"IF(I138=\"\",\"\",IF(OR(LEFT(I138,1)=\"<\",LEFT(I138,1)=\">\"),VALUE(MID(I138,2,3)),I138))","v":74.5},{"$f":"IF(J138=\"\",\"\",IF(OR(LEFT(J138,1)=\"<\",LEFT(J138,1)=\">\"),VALUE(MID(J138,2,3)),J138))","v":470},{"$f":"IF(K138=\"\",\"\",IF(OR(LEFT(K138,1)=\"<\",LEFT(K138,1)=\">\"),VALUE(MID(K138,2,3)),K138))","v":490},{"$f":"IF(L138=\"\",\"\",IF(OR(LEFT(L138,1)=\"<\",LEFT(L138,1)=\">\"),VALUE(MID(L138,2,3)),L138))","v":""},{"$f":"IF(M138=\"\",\"\",IF(OR(LEFT(M138,1)=\"<\",LEFT(M138,1)=\">\"),VALUE(MID(M138,2,3)),M138))","v":12000},{"$f":"IF(N138=\"\",\"\",IF(OR(LEFT(N138,1)=\"<\",LEFT(N138,1)=\">\"),VALUE(MID(N138,2,3)),N138))","v":1500},{"$f":"IF(O138=\"\",\"\",IF(OR(LEFT(O138,1)=\"<\",LEFT(O138,1)=\">\"),VALUE(MID(O138,2,3)),O138))","v":13000},{"$f":"IF(P138=\"\",\"\",IF(OR(LEFT(P138,1)=\"<\",LEFT(P138,1)=\">\"),VALUE(MID(P138,2,3)),P138))","v":2.4}]
[null,"15:2 Svalövsbäcken nedstr Svalöv","2020-10-21",10.6,5.4,49,7.53,2.95,69.599999999999994,380,400,"",6900,2700,8400,"<2","Resultatet av kväve total, N, är mindre än summan av ammoniumkväve, NH4-N, och nitrat + nitritkväve, NO23-N. Skillnaden ligger dock inommätosäkerheten.",2020,10,null,null,null,null,null,null,null,10.541590909090909,13.086650433746245,7.9965313844355723,2.95,7.8355303030303025,8.0354704253415363,7.6355901807190687,6.5,13.161742424242423,43.810002340134545,-17.4865174916497,7,52.671969696969711,62.81683313153323,42.527106262406193,53.603816793893131,125.17443861875186,-17.966805030965602,95.717557251908403,195.19505952555048,-3.759945021733671,100,23,34.313708498984759,11.686291501015239,5893.5877862595416,8596.4199386799191,3190.7556338391637,432.76335877862596,1842.4404130773487,-976.91369552009689,6806.1068702290077,9445.3595536514258,4166.8541868065895,5000,10.090076335877868,29.113660302029061,-8.9335076302733256,null,null,44125,null,null,null,null,null,null,null,null,null,null,null,null,null,null,10.6,5.4,49,7.53,2.95,69.599999999999994,380,400,"",6900,2700,8400,2]
[null,"15:2 Svalövsbäcken nedstr Svalöv","2020-11-26",8.1,10.8,92,7.95,10,55.6,33,65,"",9300,220,10000,8.4,"",2020,11,null,null,null,null,null,null,null,10.541590909090909,13.086650433746245,7.9965313844355723,2.95,7.8355303030303025,8.0354704253415363,7.6355901807190687,6.5,13.161742424242423,43.810002340134545,-17.4865174916497,7,52.671969696969711,62.81683313153323,42.527106262406193,53.603816793893131,125.17443861875186,-17.966805030965602,95.717557251908403,195.19505952555048,-3.759945021733671,100,23,34.313708498984759,11.686291501015239,5893.5877862595416,8596.4199386799191,3190.7556338391637,432.76335877862596,1842.4404130773487,-976.91369552009689,6806.1068702290077,9445.3595536514258,4166.8541868065895,5000,10.090076335877868,29.113660302029061,-8.9335076302733256,null,null,44161,null,null,null,null,null,null,null,null,null,null,null,null,null,null,8.1,10.8,92,7.95,10,55.6,33,65,"",9300,220,10000,8.4]
[null,"15:2 Svalövsbäcken nedstr Svalöv","2020-12-21",6.6,11.7,96,7.87,17,55.8,31,76,"",9400,140,11000,12,"",2020,12,null,null,null,null,null,null,null,10.541590909090909,13.086650433746245,7.9965313844355723,2.95,7.8355303030303025,8.0354704253415363,7.6355901807190687,6.5,13.161742424242423,43.810002340134545,-17.4865174916497,7,52.671969696969711,62.81683313153323,42.527106262406193,53.603816793893131,125.17443861875186,-17.966805030965602,95.717557251908403,195.19505952555048,-3.759945021733671,100,23,34.313708498984759,11.686291501015239,5893.5877862595416,8596.4199386799191,3190.7556338391637,432.76335877862596,1842.4404130773487,-976.91369552009689,6806.1068702290077,9445.3595536514258,4166.8541868065895,5000,10.090076335877868,29.113660302029061,-8.9335076302733256,null,null,44186,null,null,null,null,null,null,null,null,null,null,null,null,null,null,6.6,11.7,96,7.87,17,55.8,31,76,"",9400,140,11000,12]
[]
[]
[]
[null,null,"Medel",{"$f":"AVERAGE(CD$9:CD144)","v":9.4545454545454515},{"$f":"AVERAGE(CE$9:CE144)","v":10.541590909090909},{"$f":"AVERAGE(CF$9:CF144)","v":90.513127588097348},{"$f":"AVERAGE(CG$9:CG144)","v":7.8355303030303025},{"$f":"AVERAGE(CH$9:CH144)","v":13.161742424242423},{"$f":"AVERAGE(CI$9:CI144)","v":52.671969696969711},{"$f":"IFERROR(AVERAGE(CJ$9:CJ144),\"\")","v":53.603816793893131},{"$f":"AVERAGE(CK$9:CK144)","v":95.717557251908403},{"$f":"AVERAGE(CL$9:CL144)","v":23},{"$f":"AVERAGE(CM$9:CM144)","v":5893.5877862595416},{"$f":"AVERAGE(CN$9:CN144)","v":432.76335877862596},{"$f":"AVERAGE(CO$9:CO144)","v":6806.1068702290077},{"$f":"AVERAGE(CP$9:CP144)","v":10.090076335877868}]
[null,null,"Std.avv.",{"$f":"STDEV(CD$9:CD144)","v":5.4010087216795597},{"$f":"STDEV(CE$9:CE144)","v":2.5450595246553362},{"$f":"STDEV(CF$9:CF144)","v":17.644127533022875},{"$f":"STDEV(CG$9:CG144)","v":0.1999401223112339},{"$f":"STDEV(CH$9:CH144)","v":30.648259915892123},{"$f":"STDEV(CI$9:CI144)","v":10.144863434563517},{"$f":"IFERROR(STDEV(CJ$9:CJ144),\"\")","v":71.570621824858733},{"$f":"STDEV(CK$9:CK144)","v":99.477502273642074},{"$f":"STDEV(CL$9:CL144)","v":11.313708498984761},{"$f":"STDEV(CM$9:CM144)","v":2702.832152420378},{"$f":"STDEV(CN$9:CN144)","v":1409.6770542987229},{"$f":"STDEV(CO$9:CO144)","v":2639.2526834224182},{"$f":"STDEV(CP$9:CP144)","v":19.023583966151193}]
[null,null,"Max",{"$f":"MAX(CD$9:CD144)","v":21.1},{"$f":"MAX(CE$9:CE144)","v":16.3},{"$f":"MAX(CF$9:CF144)","v":163},{"$f":"MAX(CG$9:CG144)","v":8.51},{"$f":"MAX(CH$9:CH144)","v":250},{"$f":"MAX(CI$9:CI144)","v":88.1},{"$f":"MAX(CJ$9:CJ144)","v":470},{"$f":"MAX(CK$9:CK144)","v":620},{"$f":"MAX(CL$9:CL144)","v":31},{"$f":"MAX(CM$9:CM144)","v":15000},{"$f":"MAX(CN$9:CN144)","v":12000},{"$f":"MAX(CO$9:CO144)","v":15000},{"$f":"MAX(CP$9:CP144)","v":150}]
[null,null,"Min",{"$f":"MIN(CD$9:CD144)","v":-0.1},{"$f":"MIN(CE$9:CE144)","v":2.1},{"$f":"MIN(CF$9:CF144)","v":23},{"$f":"MIN(CG$9:CG144)","v":7.41},{"$f":"MIN(CH$9:CH144)","v":0.89},{"$f":"MIN(CI$9:CI144)","v":29.6},{"$f":"MIN(CJ$9:CJ144)","v":2},{"$f":"MIN(CK$9:CK144)","v":20},{"$f":"MIN(CL$9:CL144)","v":15},{"$f":"MIN(CM$9:CM144)","v":10},{"$f":"MIN(CN$9:CN144)","v":10},{"$f":"MIN(CO$9:CO144)","v":3200},{"$f":"MIN(CP$9:CP144)","v":2}]
[null,null,"Antal",{"$f":"COUNTA(D$9:D144)","v":132},{"$f":"COUNTA(E$9:E144)","v":132},{"$f":"COUNTA(F$9:F144)","v":131},{"$f":"COUNTA(G$9:G144)","v":132},{"$f":"COUNTA(H$9:H144)","v":132},{"$f":"COUNTA(I$9:I144)","v":132},{"$f":"COUNTA(J$9:J144)","v":131},{"$f":"COUNTA(K$9:K144)","v":131},{"$f":"COUNTA(L$9:L144)","v":14},{"$f":"COUNTA(M$9:M144)","v":131},{"$f":"COUNTA(N$9:N144)","v":131},{"$f":"COUNTA(O$9:O144)","v":131},{"$f":"COUNTA(P$9:P144)","v":131}]
[null,null,"SISTA"]
[]
[]
[null,null,null,null,"OBS! Värden < a (och > a) hanteras som a i beräkning av medelvärde, standardavvikelse, min och max"]

{"sheet":"Diagram","index":7,"n_rows":200,"n_cols":45,"rows_kept":200,"cut":false,"hidden":false,"merged":[]}
[]
[]
[null,null,"Provpunkt:",null,null,null,null,null,null,null,null,null,null,null,null,null,null,"Senaste provtagningsdatum",null,null,null,null,null,null,null,null,null,null,null,null,null,null,null,null,null,null,null,null,null,null,null,null,null,"Senaste provtagningsdatum"]
[null,null,{"$f":"Statistik!$B8","v":"15:2 Svalövsbäcken nedstr Svalöv"},null,null,null,null,"Statistik för:",{"$f":"MIN(Statistik!$C9:$C144)","v":"2010-01-26"},"-",{"$f":"MAX(Statistik!$C9:$C144)","v":"2020-12-21"},null,null,null,null,null,null,{"$f":"IF((VLOOKUP(C4,Provpunkter!B1:C10,2,FALSE))=12,MAX(RS!E3:E13),MAX(RS!E51:E56))","v":"2021-11-24"},null,null,null,null,null,null,null,null,null,null,null,null,null,null,null,null,null,null,null,null,null,null,null,null,null,"2021-06-21"]
[]
[]
[null,null,null,null,null,null,null,null,null,null,null,null,"Syre","halt",null,"mättnad",null,"Årets resultat",null,null,null,null,null,null,null,null,null,null,null,null,null,null,null,null,null,null,null,null,null,null,null,null,null,"Årets resultat"]
[null,null,null,null,null,null,null,null,null,null,null,null,null,"mg/l",null,"%",null,"Datum","mg/l","%",null,null,null,null,null,null,null,null,null,null,null,null,null,null,null,null,null,null,null,null,null,null,null,"Datum","mg/l"]
[null,null,null,null,null,null,null,null,null,null,null,null,"Medel",{"$f":"Statistik!E$145","v":10.541590909090909},null,{"$f":"Statistik!F$145","v":90.513127588097348},null,{"$f":"IFERROR(VLOOKUP(CONCATENATE($C$4,\"1\"),RS!$B$3:$S$110,4,FALSE),\"\")","v":"2021-01-25"},{"$f":"IFERROR(VLOOKUP(CONCATENATE($C$4,\"1\"),RS!$B$3:$S$110,6,FALSE),\"\")","v":12.8},{"$f":"IFERROR(VLOOKUP(CONCATENATE($C$4,\"1\"),RS!$B$3:$S$110,7,FALSE),\"\")","v":97},null,null,null,null,null,null,null,null,null,null,null,null,null,null,null,null,null,null,null,null,null,null,null,"2021-01-25",12.8]
[null,null,null,null,null,null,null,null,null,null,null,null,"Std.avv.",{"$f":"Statistik!E$146","v":2.5450595246553362},null,{"$f":"Statistik!F$146","v":17.644127533022875},null,{"$f":"IFERROR(VLOOKUP(CONCATENATE($C$4,\"2\"),RS!$B$3:$S$110,4,FALSE),\"\")","v":"2021-02-22"},{"$f":"IFERROR(VLOOKUP(CONCATENATE($C$4,\"2\"),RS!$B$3:$S$110,6,FALSE),\"\")","v":12.9},{"$f":"IFERROR(VLOOKUP(CONCATENATE($C$4,\"2\"),RS!$B$3:$S$110,7,FALSE),\"\")","v":96},null,null,null,null,null,null,null,null,null,null,null,null,null,null,null,null,null,null,null,null,null,null,null,"2021-02-22",12.9]
[null,null,null,null,null,null,null,null,null,null,null,null,"Max",{"$f":"Statistik!E$147","v":16.3},null,{"$f":"Statistik!F$147","v":163},null,{"$f":"IFERROR(VLOOKUP(CONCATENATE($C$4,\"3\"),RS!$B$3:$S$110,4,FALSE),\"\")","v":"2021-03-24"},{"$f":"IFERROR(VLOOKUP(CONCATENATE($C$4,\"3\"),RS!$B$3:$S$110,6,FALSE),\"\")","v":12.8},{"$f":"IFERROR(VLOOKUP(CONCATENATE($C$4,\"3\"),RS!$B$3:$S$110,7,FALSE),\"\")","v":104},null,null,null,null,null,null,null,null,null,null,null,null,null,null,null,null,null,null,null,null,null,null,null,"2021-03-24",12.8]
[null,null,null,null,null,null,null,null,null,null,null,null,"Min",{"$f":"Statistik!E$148","v":2.1},null,{"$f":"Statistik!F$148","v":23},null,{"$f":"IFERROR(VLOOKUP(CONCATENATE($C$4,\"4\"),RS!$B$3:$S$110,4,FALSE),\"\")","v":"2021-04-27"},{"$f":"IFERROR(VLOOKUP(CONCATENATE($C$4,\"4\"),RS!$B$3:$S$110,6,FALSE),\"\")","v":14.8},{"$f":"IFERROR(VLOOKUP(CONCATENATE($C$4,\"4\"),RS!$B$3:$S$110,7,FALSE),\"\")","v":121},null,null,null,null,null,null,null,null,null,null,null,null,null,null,null,null,null,null,null,null,null,null,null,"2021-04-27",14.8]
[null,null,null,null,null,null,null,null,null,null,null,null,"Antal värden",{"$f":"Statistik!E$149","v":132},null,null,null,{"$f":"IFERROR(VLOOKUP(CONCATENATE($C$4,\"5\"),RS!$B$3:$S$110,4,FALSE),\"\")","v":"2021-05-25"},{"$f":"IFERROR(VLOOKUP(CONCATENATE($C$4,\"5\"),RS!$B$3:$S$110,6,FALSE),\"\")","v":9.6},{"$f":"IFERROR(VLOOKUP(CONCATENATE($C$4,\"5\"),RS!$B$3:$S$110,7,FALSE),\"\")","v":90},null,null,null,null,null,null,null,null,null,null,null,null,null,null,null,null,null,null,null,null,null,null,null,"2021-05-25",9.6]
[null,null,null,null,null,null,null,null,null,null,null,null,null,null,null,null,null,{"$f":"IFERROR(VLOOKUP(CONCATENATE($C$4,\"6\"),RS!$B$3:$S$110,4,FALSE),\"\")","v":"2021-06-21"},{"$f":"IFERROR(VLOOKUP(CONCATENATE($C$4,\"6\"),RS!$B$3:$S$110,6,FALSE),\"\")","v":6.8},{"$f":"IFERROR(VLOOKUP(CONCATENATE($C$4,\"6\"),RS!$B$3:$S$110,7,FALSE),\"\")","v":70},null,null,null,null,null,null,null,null,null,null,null,null,null,null,null,null,null,null,null,null,null,null,null,"2021-06-21",6.8]
[null,null,null,null,null,null,null,null,null,null,null,null,"Senaste",{"$f":"VLOOKUP(TRIM(CONCATENATE($C$4,$R$4)),RS!$A$3:$R$110,7,FALSE)","v":11.5},null,{"$f":"VLOOKUP(TRIM(CONCATENATE($C$4,$R$4)),RS!$A$3:$R$110,8,FALSE)","v":97},null,{"$f":"IFERROR(VLOOKUP(CONCATENATE($C$4,\"7\"),RS!$B$3:$S$110,4,FALSE),\"\")","v":"2021-07-21"},{"$f":"IFERROR(VLOOKUP(CONCATENATE($C$4,\"7\"),RS!$B$3:$S$110,6,FALSE),\"\")","v":7.7},{"$f":"IFERROR(VLOOKUP(CONCATENATE($C$4,\"7\"),RS!$B$3:$S$110,7,FALSE),\"\")","v":80},null,null,null,null,null,null,null,null,null,null,null,null,null,null,null,null,null,null,null,null,null,null,null,null,""]
[null,null,null,null,null,null,null,null,null,null,null,null,null,null,null,null,null,{"$f":"IFERROR(VLOOKUP(CONCATENATE($C$4,\"8\"),RS!$B$3:$S$110,4,FALSE),\"\")","v":"2021-08-30"},{"$f":"IFERROR(VLOOKUP(CONCATENATE($C$4,\"8\"),RS!$B$3:$S$110,6,FALSE),\"\")","v":9.6},{"$f":"IFERROR(VLOOKUP(CONCATENATE($C$4,\"8\"),RS!$B$3:$S$110,7,FALSE),\"\")","v":98},null,null,null,null,null,null,null,null,null,null,null,null,null,null,null,null,null,null,null,null,null,null,null,null,""]
[null,null,null,null,null,null,null,null,null,null,null,null,null,null,null,null,null,{"$f":"IFERROR(VLOOKUP(CONCATENATE($C$4,\"9\"),RS!$B$3:$S$110,4,FALSE),\"\")","v":"2021-09-29"},{"$f":"IFERROR(VLOOKUP(CONCATENATE($C$4,\"9\"),RS!$B$3:$S$110,6,FALSE),\"\")","v":10.3},{"$f":"IFERROR(VLOOKUP(CONCATENATE($C$4,\"9\"),RS!$B$3:$S$110,7,FALSE),\"\")","v":99},null,null,null,null,null,null,null,null,null,null,null,null,null,null,null,null,null,null,null,null,null,null,null,null,""]
[null,null,null,null,null,null,null,null,null,null,null,null,null,null,null,null,null,{"$f":"IFERROR(VLOOKUP(CONCATENATE($C$4,\"10\"),RS!$B$3:$S$110,4,FALSE),\"\")","v":"2021-10-20"},{"$f":"IFERROR(VLOOKUP(CONCATENATE($C$4,\"10\"),RS!$B$3:$S$110,6,FALSE),\"\")","v":9.3000000000000007},{"$f":"IFERROR(VLOOKUP(CONCATENATE($C$4,\"10\"),RS!$B$3:$S$110,7,FALSE),\"\")","v":87},null,null,null,null,null,null,null,null,null,null,null,null,null,null,null,null,null,null,null,null,null,null,null,null,""]
[null,null,null,null,null,null,null,null,null,null,null,null,null,null,null,null,null,{"$f":"IFERROR(VLOOKUP(CONCATENATE($C$4,\"11\"),RS!$B$3:$S$110,4,FALSE),\"\")","v":"2021-11-24"},{"$f":"IFERROR(VLOOKUP(CONCATENATE($C$4,\"11\"),RS!$B$3:$S$110,6,FALSE),\"\")","v":11.5},{"$f":"IFERROR(VLOOKUP(CONCATENATE($C$4,\"11\"),RS!$B$3:$S$110,7,FALSE),\"\")","v":97},null,null,null,null,null,null,null,null,null,null,null,null,null,null,null,null,null,null,null,null,null,null,null,null,""]
[null,null,null,null,null,null,null,null,null,null,null,null,null,null,null,null,null,{"$f":"IFERROR(VLOOKUP(CONCATENATE($C$4,\"12\"),RS!$B$3:$S$110,4,FALSE),\"\")","v":"2021-12-21"},{"$f":"IFERROR(VLOOKUP(CONCATENATE($C$4,\"12\"),RS!$B$3:$S$110,6,FALSE),\"\")","v":12.8},{"$f":"IFERROR(VLOOKUP(CONCATENATE($C$4,\"12\"),RS!$B$3:$S$110,7,FALSE),\"\")","v":94},null,null,null,null,null,null,null,null,null,null,null,null,null,null,null,null,null,null,null,null,null,null,null,null,""]
[]
[]
[]
[]
[null,null,null,null,null,null,null,null,null,null,null,null,"Tot-N","µg/l",null,null,null,"Årets resultat",null,null,null,null,null,null,null,null,null,null,null,null,null,null,null,null,null,null,null,null,null,null,null,null,null,"Årets resultat"]
[null,null,null,null,null,null,null,null,null,null,null,null,null,null,null,null,null,"Datum","µg/l",null,null,null,null,null,null,null,null,null,null,null,null,null,null,null,null,null,null,null,null,null,null,null,null,"Datum","µg/l"]
[null,null,null,null,null,null,null,null,null,null,null,null,"Medel",{"$f":"Statistik!O$145","v":6806.1068702290077},null,null,null,{"$f":"IFERROR(VLOOKUP(CONCATENATE($C$4,\"1\"),RS!$B$3:$S$110,4,FALSE),\"\")","v":"2021-01-25"},{"$f":"IFERROR(VLOOKUP(CONCATENATE($C$4,\"1\"),RS!$B$3:$S$110,16,FALSE),\"\")","v":8900},null,null,null,null,null,null,null,null,null,null,null,null,null,null,null,null,null,null,null,null,null,null,null,null,"2021-01-25",8900]
[null,null,null,null,null,null,null,null,null,null,null,null,"Std.avv.",{"$f":"Statistik!O$146","v":2639.2526834224182},null,null,null,{"$f":"IFERROR(VLOOKUP(CONCATENATE($C$4,\"2\"),RS!$B$3:$S$110,4,FALSE),\"\")","v":"2021-02-22"},{"$f":"IFERROR(VLOOKUP(CONCATENATE($C$4,\"2\"),RS!$B$3:$S$110,16,FALSE),\"\")","v":7500},null,null,null,null,null,null,null,null,null,null,null,null,null,null,null,null,null,null,null,null,null,null,null,null,"2021-02-22",7500]
[null,null,null,null,null,null,null,null,null,null,null,null,"Max",{"$f":"Statistik!O$147","v":15000},null,null,null,{"$f":"IFERROR(VLOOKUP(CONCATENATE($C$4,\"3\"),RS!$B$3:$S$110,4,FALSE),\"\")","v":"2021-03-24"},{"$f":"IFERROR(VLOOKUP(CONCATENATE($C$4,\"3\"),RS!$B$3:$S$110,16,FALSE),\"\")","v":7400},null,null,null,null,null,null,null,null,null,null,null,null,null,null,null,null,null,null,null,null,null,null,null,null,"2021-03-24",7400]
[null,null,null,null,null,null,null,null,null,null,null,null,"Min",{"$f":"Statistik!O$148","v":3200},null,null,null,{"$f":"IFERROR(VLOOKUP(CONCATENATE($C$4,\"4\"),RS!$B$3:$S$110,4,FALSE),\"\")","v":"2021-04-27"},{"$f":"IFERROR(VLOOKUP(CONCATENATE($C$4,\"4\"),RS!$B$3:$S$110,16,FALSE),\"\")","v":4900},null,null,null,null,null,null,null,null,null,null,null,null,null,null,null,null,null,null,null,null,null,null,null,null,"2021-04-27",4900]
[null,null,null,null,null,null,null,null,null,null,null,null,"Antal värden",{"$f":"Statistik!O$149","v":131},null,null,null,{"$f":"IFERROR(VLOOKUP(CONCATENATE($C$4,\"5\"),RS!$B$3:$S$110,4,FALSE),\"\")","v":"2021-05-25"},{"$f":"IFERROR(VLOOKUP(CONCATENATE($C$4,\"5\"),RS!$B$3:$S$110,16,FALSE),\"\")","v":4400},null,null,null,null,null,null,null,null,null,null,null,null,null,null,null,null,null,null,null,null,null,null,null,null,"2021-05-25",4400]
[null,null,null,null,null,null,null,null,null,null,null,null,null,null,null,null,null,{"$f":"IFERROR(VLOOKUP(CONCATENATE($C$4,\"6\"),RS!$B$3:$S$110,4,FALSE),\"\")","v":"2021-06-21"},{"$f":"IFERROR(VLOOKUP(CONCATENATE($C$4,\"6\"),RS!$B$3:$S$110,16,FALSE),\"\")","v":10000},null,null,null,null,null,null,null,null,null,null,null,null,null,null,null,null,null,null,null,null,null,null,null,null,"2021-06-21",10000]
[null,null,null,null,null,null,null,null,null,null,null,null,"Senaste",{"$f":"VLOOKUP(TRIM(CONCATENATE($C$4,$R$4)),RS!$A$3:$R$110,17,FALSE)","v":7100},null,null,null,{"$f":"IFERROR(VLOOKUP(CONCATENATE($C$4,\"7\"),RS!$B$3:$S$110,4,FALSE),\"\")","v":"2021-07-21"},{"$f":"IFERROR(VLOOKUP(CONCATENATE($C$4,\"7\"),RS!$B$3:$S$110,16,FALSE),\"\")","v":7800},null,null,null,null,null,null,null,null,null,null,null,null,null,null,null,null,null,null,null,null,null,null,null,null,null,""]
[null,null,null,null,null,null,null,null,null,null,null,null,null,null,null,null,null,{"$f":"IFERROR(VLOOKUP(CONCATENATE($C$4,\"8\"),RS!$B$3:$S$110,4,FALSE),\"\")","v":"2021-08-30"},{"$f":"IFERROR(VLOOKUP(CONCATENATE($C$4,\"8\"),RS!$B$3:$S$110,16,FALSE),\"\")","v":""},null,null,null,null,null,null,null,null,null,null,null,null,null,null,null,null,null,null,null,null,null,null,null,null,null,""]
[null,null,null,null,null,null,null,null,null,null,null,null,null,null,null,null,null,{"$f":"IFERROR(VLOOKUP(CONCATENATE($C$4,\"9\"),RS!$B$3:$S$110,4,FALSE),\"\")","v":"2021-09-29"},{"$f":"IFERROR(VLOOKUP(CONCATENATE($C$4,\"9\"),RS!$B$3:$S$110,16,FALSE),\"\")","v":4500},null,null,null,null,null,null,null,null,null,null,null,null,null,null,null,null,null,null,null,null,null,null,null,null,null,""]
[null,null,null,null,null,null,null,null,null,null,null,null,null,null,null,null,null,{"$f":"IFERROR(VLOOKUP(CONCATENATE($C$4,\"10\"),RS!$B$3:$S$110,4,FALSE),\"\")","v":"2021-10-20"},{"$f":"IFERROR(VLOOKUP(CONCATENATE($C$4,\"10\"),RS!$B$3:$S$110,16,FALSE),\"\")","v":8700},null,null,null,null,null,null,null,null,null,null,null,null,null,null,null,null,null,null,null,null,null,null,null,null,null,""]
[null,null,null,null,null,null,null,null,null,null,null,null,null,null,null,null,null,{"$f":"IFERROR(VLOOKUP(CONCATENATE($C$4,\"11\"),RS!$B$3:$S$110,4,FALSE),\"\")","v":"2021-11-24"},{"$f":"IFERROR(VLOOKUP(CONCATENATE($C$4,\"11\"),RS!$B$3:$S$110,16,FALSE),\"\")","v":7100},null,null,null,null,null,null,null,null,null,null,null,null,null,null,null,null,null,null,null,null,null,null,null,null,null,""]
[null,null,null,null,null,null,null,null,null,null,null,null,null,null,null,null,null,{"$f":"IFERROR(VLOOKUP(CONCATENATE($C$4,\"12\"),RS!$B$3:$S$110,4,FALSE),\"\")","v":"2021-12-21"},{"$f":"IFERROR(VLOOKUP(CONCATENATE($C$4,\"12\"),RS!$B$3:$S$110,16,FALSE),\"\")","v":7200},null,null,null,null,null,null,null,null,null,null,null,null,null,null,null,null,null,null,null,null,null,null,null,null,null,""]
[]
[]
[]
[]
[null,null,null,null,null,null,null,null,null,null,null,null,"Tot-P","µg/l",null,null,null,"Årets resultat",null,null,null,null,null,null,null,null,null,null,null,null,null,null,null,null,null,null,null,null,null,null,null,null,null,"Årets resultat"]
[null,null,null,null,null,null,null,null,null,null,null,null,null,null,null,null,null,"Datum","µg/l",null,null,null,null,null,null,null,null,null,null,null,null,null,null,null,null,null,null,null,null,null,null,null,null,"Datum","µg/l"]
[null,null,null,null,null,null,null,null,null,null,null,null,"Medel",{"$f":"Statistik!K$145","v":95.717557251908403},null,null,null,{"$f":"IFERROR(VLOOKUP(CONCATENATE($C$4,\"1\"),RS!$B$3:$S$110,4,FALSE),\"\")","v":"2021-01-25"},{"$f":"IFERROR(VLOOKUP(CONCATENATE($C$4,\"1\"),RS!$B$3:$S$110,12,FALSE),\"\")","v":64},null,null,null,null,null,null,null,null,null,null,null,null,null,null,null,null,null,null,null,null,null,null,null,null,"2021-01-25",64]
[null,null,null,null,null,null,null,null,null,null,null,null,"Std.avv.",{"$f":"Statistik!K$146","v":99.477502273642074},null,null,null,{"$f":"IFERROR(VLOOKUP(CONCATENATE($C$4,\"2\"),RS!$B$3:$S$110,4,FALSE),\"\")","v":"2021-02-22"},{"$f":"IFERROR(VLOOKUP(CONCATENATE($C$4,\"2\"),RS!$B$3:$S$110,12,FALSE),\"\")","v":81},null,null,null,null,null,null,null,null,null,null,null,null,null,null,null,null,null,null,null,null,null,null,null,null,"2021-02-22",81]
[null,null,null,null,null,null,null,null,null,null,null,null,"Max",{"$f":"Statistik!K$147","v":620},null,null,null,{"$f":"IFERROR(VLOOKUP(CONCATENATE($C$4,\"3\"),RS!$B$3:$S$110,4,FALSE),\"\")","v":"2021-03-24"},{"$f":"IFERROR(VLOOKUP(CONCATENATE($C$4,\"3\"),RS!$B$3:$S$110,12,FALSE),\"\")","v":32},null,null,null,null,null,null,null,null,null,null,null,null,null,null,null,null,null,null,null,null,null,null,null,null,"2021-03-24",32]
[null,null,null,null,null,null,null,null,null,null,null,null,"Min",{"$f":"Statistik!K$148","v":20},null,null,null,{"$f":"IFERROR(VLOOKUP(CONCATENATE($C$4,\"4\"),RS!$B$3:$S$110,4,FALSE),\"\")","v":"2021-04-27"},{"$f":"IFERROR(VLOOKUP(CONCATENATE($C$4,\"4\"),RS!$B$3:$S$110,12,FALSE),\"\")","v":27},null,null,null,null,null,null,null,null,null,null,null,null,null,null,null,null,null,null,null,null,null,null,null,null,"2021-04-27",27]
[null,null,null,null,null,null,null,null,null,null,null,null,"Antal värden",{"$f":"Statistik!K$149","v":131},null,null,null,{"$f":"IFERROR(VLOOKUP(CONCATENATE($C$4,\"5\"),RS!$B$3:$S$110,4,FALSE),\"\")","v":"2021-05-25"},{"$f":"IFERROR(VLOOKUP(CONCATENATE($C$4,\"5\"),RS!$B$3:$S$110,12,FALSE),\"\")","v":39},null,null,null,null,null,null,null,null,null,null,null,null,null,null,null,null,null,null,null,null,null,null,null,null,"2021-05-25",39]
[null,null,null,null,null,null,null,null,null,null,null,null,null,null,null,null,null,{"$f":"IFERROR(VLOOKUP(CONCATENATE($C$4,\"6\"),RS!$B$3:$S$110,4,FALSE),\"\")","v":"2021-06-21"},{"$f":"IFERROR(VLOOKUP(CONCATENATE($C$4,\"6\"),RS!$B$3:$S$110,12,FALSE),\"\")","v":110},null,null,null,null,null,null,null,null,null,null,null,null,null,null,null,null,null,null,null,null,null,null,null,null,"2021-06-21",110]
[null,null,null,null,null,null,null,null,null,null,null,null,"Senaste",{"$f":"VLOOKUP(TRIM(CONCATENATE($C$4,$R$4)),RS!$A$3:$R$110,13,FALSE)","v":60},null,null,null,{"$f":"IFERROR(VLOOKUP(CONCATENATE($C$4,\"7\"),RS!$B$3:$S$110,4,FALSE),\"\")","v":"2021-07-21"},{"$f":"IFERROR(VLOOKUP(CONCATENATE($C$4,\"7\"),RS!$B$3:$S$110,12,FALSE),\"\")","v":98},null,null,null,null,null,null,null,null,null,null,null,null,null,null,null,null,null,null,null,null,null,null,null,null,null,""]
[null,null,null,null,null,null,null,null,null,null,null,null,null,null,null,null,null,{"$f":"IFERROR(VLOOKUP(CONCATENATE($C$4,\"8\"),RS!$B$3:$S$110,4,FALSE),\"\")","v":"2021-08-30"},{"$f":"IFERROR(VLOOKUP(CONCATENATE($C$4,\"8\"),RS!$B$3:$S$110,12,FALSE),\"\")","v":""},null,null,null,null,null,null,null,null,null,null,null,null,null,null,null,null,null,null,null,null,null,null,null,null,null,""]
[null,null,null,null,null,null,null,null,null,null,null,null,null,null,null,null,null,{"$f":"IFERROR(VLOOKUP(CONCATENATE($C$4,\"9\"),RS!$B$3:$S$110,4,FALSE),\"\")","v":"2021-09-29"},{"$f":"IFERROR(VLOOKUP(CONCATENATE($C$4,\"9\"),RS!$B$3:$S$110,12,FALSE),\"\")","v":110},null,null,null,null,null,null,null,null,null,null,null,null,null,null,null,null,null,null,null,null,null,null,null,null,null,""]
[null,null,null,null,null,null,null,null,null,null,null,null,null,null,null,null,null,{"$f":"IFERROR(VLOOKUP(CONCATENATE($C$4,\"10\"),RS!$B$3:$S$110,4,FALSE),\"\")","v":"2021-10-20"},{"$f":"IFERROR(VLOOKUP(CONCATENATE($C$4,\"10\"),RS!$B$3:$S$110,12,FALSE),\"\")","v":220},null,null,null,null,null,null,null,null,null,null,null,null,null,null,null,null,null,null,null,null,null,null,null,null,null,""]
[null,null,null,null,null,null,null,null,null,null,null,null,null,null,null,null,null,{"$f":"IFERROR(VLOOKUP(CONCATENATE($C$4,\"11\"),RS!$B$3:$S$110,4,FALSE),\"\")","v":"2021-11-24"},{"$f":"IFERROR(VLOOKUP(CONCATENATE($C$4,\"11\"),RS!$B$3:$S$110,12,FALSE),\"\")","v":60},null,null,null,null,null,null,null,null,null,null,null,null,null,null,null,null,null,null,null,null,null,null,null,null,null,""]
[null,null,null,null,null,null,null,null,null,null,null,null,null,null,null,null,null,{"$f":"IFERROR(VLOOKUP(CONCATENATE($C$4,\"12\"),RS!$B$3:$S$110,4,FALSE),\"\")","v":"2021-12-21"},{"$f":"IFERROR(VLOOKUP(CONCATENATE($C$4,\"12\"),RS!$B$3:$S$110,12,FALSE),\"\")","v":36},null,null,null,null,null,null,null,null,null,null,null,null,null,null,null,null,null,null,null,null,null,null,null,null,null,""]
[]
[]
[]
[]
[null,null,null,null,null,null,null,null,null,null,null,null,"pH",null,null,null,null,"Årets resultat",null,null,null,null,null,null,null,null,null,null,null,null,null,null,null,null,null,null,null,null,null,null,null,null,null,"Årets resultat"]
[null,null,null,null,null,null,null,null,null,null,null,null,null,null,null,null,null,"Datum",null,null,null,null,null,null,null,null,null,null,null,null,null,null,null,null,null,null,null,null,null,null,null,null,null,"Datum"]
[null,null,null,null,null,null,null,null,null,null,null,null,"Medel",{"$f":"Statistik!G$145","v":7.8355303030303025},null,null,null,{"$f":"IFERROR(VLOOKUP(CONCATENATE($C$4,\"1\"),RS!$B$3:$S$110,4,FALSE),\"\")","v":"2021-01-25"},{"$f":"IFERROR(VLOOKUP(CONCATENATE($C$4,\"1\"),RS!$B$3:$S$110,8,FALSE),\"\")","v":7.76},null,null,null,null,null,null,null,null,null,null,null,null,null,null,null,null,null,null,null,null,null,null,null,null,"2021-01-25",7.76]
[null,null,null,null,null,null,null,null,null,null,null,null,"Std.avv.",{"$f":"Statistik!G$146","v":0.1999401223112339},null,null,null,{"$f":"IFERROR(VLOOKUP(CONCATENATE($C$4,\"2\"),RS!$B$3:$S$110,4,FALSE),\"\")","v":"2021-02-22"},{"$f":"IFERROR(VLOOKUP(CONCATENATE($C$4,\"2\"),RS!$B$3:$S$110,8,FALSE),\"\")","v":7.69},null,null,null,null,null,null,null,null,null,null,null,null,null,null,null,null,null,null,null,null,null,null,null,null,"2021-02-22",7.69]
[null,null,null,null,null,null,null,null,null,null,null,null,"Max",{"$f":"Statistik!G$147","v":8.51},null,null,null,{"$f":"IFERROR(VLOOKUP(CONCATENATE($C$4,\"3\"),RS!$B$3:$S$110,4,FALSE),\"\")","v":"2021-03-24"},{"$f":"IFERROR(VLOOKUP(CONCATENATE($C$4,\"3\"),RS!$B$3:$S$110,8,FALSE),\"\")","v":8.0399999999999991},null,null,null,null,null,null,null,null,null,null,null,null,null,null,null,null,null,null,null,null,null,null,null,null,"2021-03-24",8.0399999999999991]
[null,null,null,null,null,null,null,null,null,null,null,null,"Min",{"$f":"Statistik!G$148","v":7.41},null,null,null,{"$f":"IFERROR(VLOOKUP(CONCATENATE($C$4,\"4\"),RS!$B$3:$S$110,4,FALSE),\"\")","v":"2021-04-27"},{"$f":"IFERROR(VLOOKUP(CONCATENATE($C$4,\"4\"),RS!$B$3:$S$110,8,FALSE),\"\")","v":8.1},null,null,null,null,null,null,null,null,null,null,null,null,null,null,null,null,null,null,null,null,null,null,null,null,"2021-04-27",8.1]
[null,null,null,null,null,null,null,null,null,null,null,null,"Antal värden",{"$f":"Statistik!G$149","v":132},null,null,null,{"$f":"IFERROR(VLOOKUP(CONCATENATE($C$4,\"5\"),RS!$B$3:$S$110,4,FALSE),\"\")","v":"2021-05-25"},{"$f":"IFERROR(VLOOKUP(CONCATENATE($C$4,\"5\"),RS!$B$3:$S$110,8,FALSE),\"\")","v":8},null,null,null,null,null,null,null,null,null,null,null,null,null,null,null,null,null,null,null,null,null,null,null,null,"2021-05-25",8]
[null,null,null,null,null,null,null,null,null,null,null,null,null,null,null,null,null,{"$f":"IFERROR(VLOOKUP(CONCATENATE($C$4,\"6\"),RS!$B$3:$S$110,4,FALSE),\"\")","v":"2021-06-21"},{"$f":"IFERROR(VLOOKUP(CONCATENATE($C$4,\"6\"),RS!$B$3:$S$110,8,FALSE),\"\")","v":7.65},null,null,null,null,null,null,null,null,null,null,null,null,null,null,null,null,null,null,null,null,null,null,null,null,"2021-06-21",7.65]
[null,null,null,null,null,null,null,null,null,null,null,null,"Senaste",{"$f":"VLOOKUP(TRIM(CONCATENATE($C$4,$R$4)),RS!$A$3:$R$110,9,FALSE)","v":8.0399999999999991},null,null,null,{"$f":"IFERROR(VLOOKUP(CONCATENATE($C$4,\"7\"),RS!$B$3:$S$110,4,FALSE),\"\")","v":"2021-07-21"},{"$f":"IFERROR(VLOOKUP(CONCATENATE($C$4,\"7\"),RS!$B$3:$S$110,8,FALSE),\"\")","v":7.74},null,null,null,null,null,null,null,null,null,null,null,null,null,null,null,null,null,null,null,null,null,null,null,null,null,""]
[null,null,null,null,null,null,null,null,null,null,null,null,null,null,null,null,null,{"$f":"IFERROR(VLOOKUP(CONCATENATE($C$4,\"8\"),RS!$B$3:$S$110,4,FALSE),\"\")","v":"2021-08-30"},{"$f":"IFERROR(VLOOKUP(CONCATENATE($C$4,\"8\"),RS!$B$3:$S$110,8,FALSE),\"\")","v":8.02},null,null,null,null,null,null,null,null,null,null,null,null,null,null,null,null,null,null,null,null,null,null,null,null,null,""]
[null,null,null,null,null,null,null,null,null,null,null,null,null,null,null,null,null,{"$f":"IFERROR(VLOOKUP(CONCATENATE($C$4,\"9\"),RS!$B$3:$S$110,4,FALSE),\"\")","v":"2021-09-29"},{"$f":"IFERROR(VLOOKUP(CONCATENATE($C$4,\"9\"),RS!$B$3:$S$110,8,FALSE),\"\")","v":7.97},null,null,null,null,null,null,null,null,null,null,null,null,null,null,null,null,null,null,null,null,null,null,null,null,null,""]
[null,null,null,null,null,null,null,null,null,null,null,null,null,null,null,null,null,{"$f":"IFERROR(VLOOKUP(CONCATENATE($C$4,\"10\"),RS!$B$3:$S$110,4,FALSE),\"\")","v":"2021-10-20"},{"$f":"IFERROR(VLOOKUP(CONCATENATE($C$4,\"10\"),RS!$B$3:$S$110,8,FALSE),\"\")","v":7.75},null,null,null,null,null,null,null,null,null,null,null,null,null,null,null,null,null,null,null,null,null,null,null,null,null,""]
[null,null,null,null,null,null,null,null,null,null,null,null,null,null,null,null,null,{"$f":"IFERROR(VLOOKUP(CONCATENATE($C$4,\"11\"),RS!$B$3:$S$110,4,FALSE),\"\")","v":"2021-11-24"},{"$f":"IFERROR(VLOOKUP(CONCATENATE($C$4,\"11\"),RS!$B$3:$S$110,8,FALSE),\"\")","v":8.0399999999999991},null,null,null,null,null,null,null,null,null,null,null,null,null,null,null,null,null,null,null,null,null,null,null,null,null,""]
[null,null,null,null,null,null,null,null,null,null,null,null,null,null,null,null,null,{"$f":"IFERROR(VLOOKUP(CONCATENATE($C$4,\"12\"),RS!$B$3:$S$110,4,FALSE),\"\")","v":"2021-12-21"},{"$f":"IFERROR(VLOOKUP(CONCATENATE($C$4,\"12\"),RS!$B$3:$S$110,8,FALSE),\"\")","v":7.8},null,null,null,null,null,null,null,null,null,null,null,null,null,null,null,null,null,null,null,null,null,null,null,null,null,""]
[]
[]
[]
[]
[null,null,null,null,null,null,null,null,null,null,null,null,"Grumlighet","FNU",null,null,null,"Årets resultat",null,null,null,null,null,null,null,null,null,null,null,null,null,null,null,null,null,null,null,null,null,null,null,null,null,"Årets resultat"]
[null,null,null,null,null,null,null,null,null,null,null,null,"(Turbiditet)",null,null,null,null,"Datum","FNU",null,null,null,null,null,null,null,null,null,null,null,null,null,null,null,null,null,null,null,null,null,null,null,null,"Datum","FNU"]
[null,null,null,null,null,null,null,null,null,null,null,null,"Medel",{"$f":"Statistik!H$145","v":13.161742424242423},null,null,null,{"$f":"IFERROR(VLOOKUP(CONCATENATE($C$4,\"1\"),RS!$B$3:$S$110,4,FALSE),\"\")","v":"2021-01-25"},{"$f":"IFERROR(VLOOKUP(CONCATENATE($C$4,\"1\"),RS!$B$3:$S$110,9,FALSE),\"\")","v":13},null,null,null,null,null,null,null,null,null,null,null,null,null,null,null,null,null,null,null,null,null,null,null,null,"2021-01-25",13]
[null,null,null,null,null,null,null,null,null,null,null,null,"Std.avv.",{"$f":"Statistik!H$146","v":30.648259915892123},null,null,null,{"$f":"IFERROR(VLOOKUP(CONCATENATE($C$4,\"2\"),RS!$B$3:$S$110,4,FALSE),\"\")","v":"2021-02-22"},{"$f":"IFERROR(VLOOKUP(CONCATENATE($C$4,\"2\"),RS!$B$3:$S$110,9,FALSE),\"\")","v":14},null,null,null,null,null,null,null,null,null,null,null,null,null,null,null,null,null,null,null,null,null,null,null,null,"2021-02-22",14]
[null,null,null,null,null,null,null,null,null,null,null,null,"Max",{"$f":"Statistik!H$147","v":250},null,null,null,{"$f":"IFERROR(VLOOKUP(CONCATENATE($C$4,\"3\"),RS!$B$3:$S$110,4,FALSE),\"\")","v":"2021-03-24"},{"$f":"IFERROR(VLOOKUP(CONCATENATE($C$4,\"3\"),RS!$B$3:$S$110,9,FALSE),\"\")","v":4.0999999999999996},null,null,null,null,null,null,null,null,null,null,null,null,null,null,null,null,null,null,null,null,null,null,null,null,"2021-03-24",4.0999999999999996]
[null,null,null,null,null,null,null,null,null,null,null,null,"Min",{"$f":"Statistik!H$148","v":0.89},null,null,null,{"$f":"IFERROR(VLOOKUP(CONCATENATE($C$4,\"4\"),RS!$B$3:$S$110,4,FALSE),\"\")","v":"2021-04-27"},{"$f":"IFERROR(VLOOKUP(CONCATENATE($C$4,\"4\"),RS!$B$3:$S$110,9,FALSE),\"\")","v":3.7},null,null,null,null,null,null,null,null,null,null,null,null,null,null,null,null,null,null,null,null,null,null,null,null,"2021-04-27",3.7]
[null,null,null,null,null,null,null,null,null,null,null,null,"Antal värden",{"$f":"Statistik!H$149","v":132},null,null,null,{"$f":"IFERROR(VLOOKUP(CONCATENATE($C$4,\"5\"),RS!$B$3:$S$110,4,FALSE),\"\")","v":"2021-05-25"},{"$f":"IFERROR(VLOOKUP(CONCATENATE($C$4,\"5\"),RS!$B$3:$S$110,9,FALSE),\"\")","v":1.8},null,null,null,null,null,null,null,null,null,null,null,null,null,null,null,null,null,null,null,null,null,null,null,null,"2021-05-25",1.8]
[null,null,null,null,null,null,null,null,null,null,null,null,null,null,null,null,null,{"$f":"IFERROR(VLOOKUP(CONCATENATE($C$4,\"6\"),RS!$B$3:$S$110,4,FALSE),\"\")","v":"2021-06-21"},{"$f":"IFERROR(VLOOKUP(CONCATENATE($C$4,\"6\"),RS!$B$3:$S$110,9,FALSE),\"\")","v":1.2},null,null,null,null,null,null,null,null,null,null,null,null,null,null,null,null,null,null,null,null,null,null,null,null,"2021-06-21",1.2]
[null,null,null,null,null,null,null,null,null,null,null,null,"Senaste",{"$f":"VLOOKUP(TRIM(CONCATENATE($C$4,$R$4)),RS!$A$3:$R$110,10,FALSE)","v":3.9},null,null,null,{"$f":"IFERROR(VLOOKUP(CONCATENATE($C$4,\"7\"),RS!$B$3:$S$110,4,FALSE),\"\")","v":"2021-07-21"},{"$f":"IFERROR(VLOOKUP(CONCATENATE($C$4,\"7\"),RS!$B$3:$S$110,9,FALSE),\"\")","v":4.8},null,null,null,null,null,null,null,null,null,null,null,null,null,null,null,null,null,null,null,null,null,null,null,null,null,""]
[null,null,null,null,null,null,null,null,null,null,null,null,null,null,null,null,null,{"$f":"IFERROR(VLOOKUP(CONCATENATE($C$4,\"8\"),RS!$B$3:$S$110,4,FALSE),\"\")","v":"2021-08-30"},{"$f":"IFERROR(VLOOKUP(CONCATENATE($C$4,\"8\"),RS!$B$3:$S$110,9,FALSE),\"\")","v":7.1},null,null,null,null,null,null,null,null,null,null,null,null,null,null,null,null,null,null,null,null,null,null,null,null,null,""]
[null,null,null,null,null,null,null,null,null,null,null,null,null,null,null,null,null,{"$f":"IFERROR(VLOOKUP(CONCATENATE($C$4,\"9\"),RS!$B$3:$S$110,4,FALSE),\"\")","v":"2021-09-29"},{"$f":"IFERROR(VLOOKUP(CONCATENATE($C$4,\"9\"),RS!$B$3:$S$110,9,FALSE),\"\")","v":13},null,null,null,null,null,null,null,null,null,null,null,null,null,null,null,null,null,null,null,null,null,null,null,null,null,""]
[null,null,null,null,null,null,null,null,null,null,null,null,null,null,null,null,null,{"$f":"IFERROR(VLOOKUP(CONCATENATE($C$4,\"10\"),RS!$B$3:$S$110,4,FALSE),\"\")","v":"2021-10-20"},{"$f":"IFERROR(VLOOKUP(CONCATENATE($C$4,\"10\"),RS!$B$3:$S$110,9,FALSE),\"\")","v":55},null,null,null,null,null,null,null,null,null,null,null,null,null,null,null,null,null,null,null,null,null,null,null,null,null,""]
[null,null,null,null,null,null,null,null,null,null,null,null,null,null,null,null,null,{"$f":"IFERROR(VLOOKUP(CONCATENATE($C$4,\"11\"),RS!$B$3:$S$110,4,FALSE),\"\")","v":"2021-11-24"},{"$f":"IFERROR(VLOOKUP(CONCATENATE($C$4,\"11\"),RS!$B$3:$S$110,9,FALSE),\"\")","v":3.9},null,null,null,null,null,null,null,null,null,null,null,null,null,null,null,null,null,null,null,null,null,null,null,null,null,""]
[null,null,null,null,null,null,null,null,null,null,null,null,null,null,null,null,null,{"$f":"IFERROR(VLOOKUP(CONCATENATE($C$4,\"12\"),RS!$B$3:$S$110,4,FALSE),\"\")","v":"2021-12-21"},{"$f":"IFERROR(VLOOKUP(CONCATENATE($C$4,\"12\"),RS!$B$3:$S$110,9,FALSE),\"\")","v":5.4},null,null,null,null,null,null,null,null,null,null,null,null,null,null,null,null,null,null,null,null,null,null,null,null,null,""]
[]
[]
[]
[]
[null,null,null,null,null,null,null,null,null,null,null,null,"Kond","mS/m",null,null,null,"Årets resultat",null,null,null,null,null,null,null,null,null,null,null,null,null,null,null,null,null,null,null,null,null,null,null,null,null,"Årets resultat"]
[null,null,null,null,null,null,null,null,null,null,null,null,null,null,null,null,null,"Datum","mS/m",null,null,null,null,null,null,null,null,null,null,null,null,null,null,null,null,null,null,null,null,null,null,null,null,"Datum","mS/m"]
[null,null,null,null,null,null,null,null,null,null,null,null,"Medel",{"$f":"Statistik!I$145","v":52.671969696969711},null,null,null,{"$f":"IFERROR(VLOOKUP(CONCATENATE($C$4,\"1\"),RS!$B$3:$S$110,4,FALSE),\"\")","v":"2021-01-25"},{"$f":"IFERROR(VLOOKUP(CONCATENATE($C$4,\"1\"),RS!$B$3:$S$110,10,FALSE),\"\")","v":45.1},null,null,null,null,null,null,null,null,null,null,null,null,null,null,null,null,null,null,null,null,null,null,null,null,"2021-01-25",45.1]
[null,null,null,null,null,null,null,null,null,null,null,null,"Std.avv.",{"$f":"Statistik!I$146","v":10.144863434563517},null,null,null,{"$f":"IFERROR(VLOOKUP(CONCATENATE($C$4,\"2\"),RS!$B$3:$S$110,4,FALSE),\"\")","v":"2021-02-22"},{"$f":"IFERROR(VLOOKUP(CONCATENATE($C$4,\"2\"),RS!$B$3:$S$110,10,FALSE),\"\")","v":39.9},null,null,null,null,null,null,null,null,null,null,null,null,null,null,null,null,null,null,null,null,null,null,null,null,"2021-02-22",39.9]
[null,null,null,null,null,null,null,null,null,null,null,null,"Max",{"$f":"Statistik!I$147","v":88.1},null,null,null,{"$f":"IFERROR(VLOOKUP(CONCATENATE($C$4,\"3\"),RS!$B$3:$S$110,4,FALSE),\"\")","v":"2021-03-24"},{"$f":"IFERROR(VLOOKUP(CONCATENATE($C$4,\"3\"),RS!$B$3:$S$110,10,FALSE),\"\")","v":48.8},null,null,null,null,null,null,null,null,null,null,null,null,null,null,null,null,null,null,null,null,null,null,null,null,"2021-03-24",48.8]
[null,null,null,null,null,null,null,null,null,null,null,null,"Min",{"$f":"Statistik!I$148","v":29.6},null,null,null,{"$f":"IFERROR(VLOOKUP(CONCATENATE($C$4,\"4\"),RS!$B$3:$S$110,4,FALSE),\"\")","v":"2021-04-27"},{"$f":"IFERROR(VLOOKUP(CONCATENATE($C$4,\"4\"),RS!$B$3:$S$110,10,FALSE),\"\")","v":54.2},null,null,null,null,null,null,null,null,null,null,null,null,null,null,null,null,null,null,null,null,null,null,null,null,"2021-04-27",54.2]
[null,null,null,null,null,null,null,null,null,null,null,null,"Antal värden",{"$f":"Statistik!I$149","v":132},null,null,null,{"$f":"IFERROR(VLOOKUP(CONCATENATE($C$4,\"5\"),RS!$B$3:$S$110,4,FALSE),\"\")","v":"2021-05-25"},{"$f":"IFERROR(VLOOKUP(CONCATENATE($C$4,\"5\"),RS!$B$3:$S$110,10,FALSE),\"\")","v":56.4},null,null,null,null,null,null,null,null,null,null,null,null,null,null,null,null,null,null,null,null,null,null,null,null,"2021-05-25",56.4]
[null,null,null,null,null,null,null,null,null,null,null,null,null,null,null,null,null,{"$f":"IFERROR(VLOOKUP(CONCATENATE($C$4,\"6\"),RS!$B$3:$S$110,4,FALSE),\"\")","v":"2021-06-21"},{"$f":"IFERROR(VLOOKUP(CONCATENATE($C$4,\"6\"),RS!$B$3:$S$110,10,FALSE),\"\")","v":69.099999999999994},null,null,null,null,null,null,null,null,null,null,null,null,null,null,null,null,null,null,null,null,null,null,null,null,"2021-06-21",69.099999999999994]
[null,null,null,null,null,null,null,null,null,null,null,null,"Senaste",{"$f":"VLOOKUP(TRIM(CONCATENATE($C$4,$R$4)),RS!$A$3:$R$110,11,FALSE)","v":57.4},null,null,null,{"$f":"IFERROR(VLOOKUP(CONCATENATE($C$4,\"7\"),RS!$B$3:$S$110,4,FALSE),\"\")","v":"2021-07-21"},{"$f":"IFERROR(VLOOKUP(CONCATENATE($C$4,\"7\"),RS!$B$3:$S$110,10,FALSE),\"\")","v":66.400000000000006},null,null,null,null,null,null,null,null,null,null,null,null,null,null,null,null,null,null,null,null,null,null,null,null,null,""]
[null,null,null,null,null,null,null,null,null,null,null,null,null,null,null,null,null,{"$f":"IFERROR(VLOOKUP(CONCATENATE($C$4,\"8\"),RS!$B$3:$S$110,4,FALSE),\"\")","v":"2021-08-30"},{"$f":"IFERROR(VLOOKUP(CONCATENATE($C$4,\"8\"),RS!$B$3:$S$110,10,FALSE),\"\")","v":55.8},null,null,null,null,null,null,null,null,null,null,null,null,null,null,null,null,null,null,null,null,null,null,null,null,null,""]
[null,null,null,null,null,null,null,null,null,null,null,null,null,null,null,null,null,{"$f":"IFERROR(VLOOKUP(CONCATENATE($C$4,\"9\"),RS!$B$3:$S$110,4,FALSE),\"\")","v":"2021-09-29"},{"$f":"IFERROR(VLOOKUP(CONCATENATE($C$4,\"9\"),RS!$B$3:$S$110,10,FALSE),\"\")","v":55.9},null,null,null,null,null,null,null,null,null,null,null,null,null,null,null,null,null,null,null,null,null,null,null,null,null,""]
[null,null,null,null,null,null,null,null,null,null,null,null,null,null,null,null,null,{"$f":"IFERROR(VLOOKUP(CONCATENATE($C$4,\"10\"),RS!$B$3:$S$110,4,FALSE),\"\")","v":"2021-10-20"},{"$f":"IFERROR(VLOOKUP(CONCATENATE($C$4,\"10\"),RS!$B$3:$S$110,10,FALSE),\"\")","v":52.4},null,null,null,null,null,null,null,null,null,null,null,null,null,null,null,null,null,null,null,null,null,null,null,null,null,""]
[null,null,null,null,null,null,null,null,null,null,null,null,null,null,null,null,null,{"$f":"IFERROR(VLOOKUP(CONCATENATE($C$4,\"11\"),RS!$B$3:$S$110,4,FALSE),\"\")","v":"2021-11-24"},{"$f":"IFERROR(VLOOKUP(CONCATENATE($C$4,\"11\"),RS!$B$3:$S$110,10,FALSE),\"\")","v":57.4},null,null,null,null,null,null,null,null,null,null,null,null,null,null,null,null,null,null,null,null,null,null,null,null,null,""]
[null,null,null,null,null,null,null,null,null,null,null,null,null,null,null,null,null,{"$f":"IFERROR(VLOOKUP(CONCATENATE($C$4,\"12\"),RS!$B$3:$S$110,4,FALSE),\"\")","v":"2021-12-21"},{"$f":"IFERROR(VLOOKUP(CONCATENATE($C$4,\"12\"),RS!$B$3:$S$110,10,FALSE),\"\")","v":47.8},null,null,null,null,null,null,null,null,null,null,null,null,null,null,null,null,null,null,null,null,null,null,null,null,null,""]
[]
[]
[]
[]
[null,null,null,null,null,null,null,null,null,null,null,null,"Susp","mg/l",null,null,null,"Årets resultat",null,null,null,null,null,null,null,null,null,null,null,null,null,null,null,null,null,null,null,null,null,null,null,null,null,"Årets resultat"]
[null,null,null,null,null,null,null,null,null,null,null,null,null,null,null,null,null,"Datum","mg/l",null,null,null,null,null,null,null,null,null,null,null,null,null,null,null,null,null,null,null,null,null,null,null,null,"Datum","mg/l"]
[null,null,null,null,null,null,null,null,null,null,null,null,"Medel",{"$f":"Statistik!P$145","v":10.090076335877868},null,null,null,{"$f":"IFERROR(VLOOKUP(CONCATENATE($C$4,\"1\"),RS!$B$3:$S$110,4,FALSE),\"\")","v":"2021-01-25"},{"$f":"IFERROR(VLOOKUP(CONCATENATE($C$4,\"1\"),RS!$B$3:$S$110,17,FALSE),\"\")","v":5.0999999999999996},null,null,null,null,null,null,null,null,null,null,null,null,null,null,null,null,null,null,null,null,null,null,null,null,"2021-01-25",5.0999999999999996]
[null,null,null,null,null,null,null,null,null,null,null,null,"Std.avv.",{"$f":"Statistik!P$146","v":19.023583966151193},null,null,null,{"$f":"IFERROR(VLOOKUP(CONCATENATE($C$4,\"2\"),RS!$B$3:$S$110,4,FALSE),\"\")","v":"2021-02-22"},{"$f":"IFERROR(VLOOKUP(CONCATENATE($C$4,\"2\"),RS!$B$3:$S$110,17,FALSE),\"\")","v":6.8},null,null,null,null,null,null,null,null,null,null,null,null,null,null,null,null,null,null,null,null,null,null,null,null,"2021-02-22",6.8]
[null,null,null,null,null,null,null,null,null,null,null,null,"Max",{"$f":"Statistik!P$147","v":150},null,null,null,{"$f":"IFERROR(VLOOKUP(CONCATENATE($C$4,\"3\"),RS!$B$3:$S$110,4,FALSE),\"\")","v":"2021-03-24"},{"$f":"IFERROR(VLOOKUP(CONCATENATE($C$4,\"3\"),RS!$B$3:$S$110,17,FALSE),\"\")","v":3},null,null,null,null,null,null,null,null,null,null,null,null,null,null,null,null,null,null,null,null,null,null,null,null,"2021-03-24",3]
[null,null,null,null,null,null,null,null,null,null,null,null,"Min",{"$f":"Statistik!P$148","v":2},null,null,null,{"$f":"IFERROR(VLOOKUP(CONCATENATE($C$4,\"4\"),RS!$B$3:$S$110,4,FALSE),\"\")","v":"2021-04-27"},{"$f":"IFERROR(VLOOKUP(CONCATENATE($C$4,\"4\"),RS!$B$3:$S$110,17,FALSE),\"\")","v":"<2"},null,null,null,null,null,null,null,null,null,null,null,null,null,null,null,null,null,null,null,null,null,null,null,null,"2021-04-27","<2"]
[null,null,null,null,null,null,null,null,null,null,null,null,"Antal värden",{"$f":"Statistik!P$149","v":131},null,null,null,{"$f":"IFERROR(VLOOKUP(CONCATENATE($C$4,\"5\"),RS!$B$3:$S$110,4,FALSE),\"\")","v":"2021-05-25"},{"$f":"IFERROR(VLOOKUP(CONCATENATE($C$4,\"5\"),RS!$B$3:$S$110,17,FALSE),\"\")","v":"<2"},null,null,null,null,null,null,null,null,null,null,null,null,null,null,null,null,null,null,null,null,null,null,null,null,"2021-05-25","<2"]
[null,null,null,null,null,null,null,null,null,null,null,null,null,null,null,null,null,{"$f":"IFERROR(VLOOKUP(CONCATENATE($C$4,\"6\"),RS!$B$3:$S$110,4,FALSE),\"\")","v":"2021-06-21"},{"$f":"IFERROR(VLOOKUP(CONCATENATE($C$4,\"6\"),RS!$B$3:$S$110,17,FALSE),\"\")","v":"<2"},null,null,null,null,null,null,null,null,null,null,null,null,null,null,null,null,null,null,null,null,null,null,null,null,"2021-06-21","<2"]
[null,null,null,null,null,null,null,null,null,null,null,null,"Senaste",{"$f":"VLOOKUP(TRIM(CONCATENATE($C$4,$R$4)),RS!$A$3:$R$110,18,FALSE)","v":3.7},null,null,null,{"$f":"IFERROR(VLOOKUP(CONCATENATE($C$4,\"7\"),RS!$B$3:$S$110,4,FALSE),\"\")","v":"2021-07-21"},{"$f":"IFERROR(VLOOKUP(CONCATENATE($C$4,\"7\"),RS!$B$3:$S$110,17,FALSE),\"\")","v":3.3},null,null,null,null,null,null,null,null,null,null,null,null,null,null,null,null,null,null,null,null,null,null,null,null,null,""]
[null,null,null,null,null,null,null,null,null,null,null,null,null,null,null,null,null,{"$f":"IFERROR(VLOOKUP(CONCATENATE($C$4,\"8\"),RS!$B$3:$S$110,4,FALSE),\"\")","v":"2021-08-30"},{"$f":"IFERROR(VLOOKUP(CONCATENATE($C$4,\"8\"),RS!$B$3:$S$110,17,FALSE),\"\")","v":""},null,null,null,null,null,null,null,null,null,null,null,null,null,null,null,null,null,null,null,null,null,null,null,null,null,""]
[null,null,null,null,null,null,null,null,null,null,null,null,null,null,null,null,null,{"$f":"IFERROR(VLOOKUP(CONCATENATE($C$4,\"9\"),RS!$B$3:$S$110,4,FALSE),\"\")","v":"2021-09-29"},{"$f":"IFERROR(VLOOKUP(CONCATENATE($C$4,\"9\"),RS!$B$3:$S$110,17,FALSE),\"\")","v":12},null,null,null,null,null,null,null,null,null,null,null,null,null,null,null,null,null,null,null,null,null,null,null,null,null,""]
[null,null,null,null,null,null,null,null,null,null,null,null,null,null,null,null,null,{"$f":"IFERROR(VLOOKUP(CONCATENATE($C$4,\"10\"),RS!$B$3:$S$110,4,FALSE),\"\")","v":"2021-10-20"},{"$f":"IFERROR(VLOOKUP(CONCATENATE($C$4,\"10\"),RS!$B$3:$S$110,17,FALSE),\"\")","v":86},null,null,null,null,null,null,null,null,null,null,null,null,null,null,null,null,null,null,null,null,null,null,null,null,null,""]
[null,null,null,null,null,null,null,null,null,null,null,null,null,null,null,null,null,{"$f":"IFERROR(VLOOKUP(CONCATENATE($C$4,\"11\"),RS!$B$3:$S$110,4,FALSE),\"\")","v":"2021-11-24"},{"$f":"IFERROR(VLOOKUP(CONCATENATE($C$4,\"11\"),RS!$B$3:$S$110,17,FALSE),\"\")","v":3.7},null,null,null,null,null,null,null,null,null,null,null,null,null,null,null,null,null,null,null,null,null,null,null,null,null,""]
[null,null,null,null,null,null,null,null,null,null,null,null,null,null,null,null,null,{"$f":"IFERROR(VLOOKUP(CONCATENATE($C$4,\"12\"),RS!$B$3:$S$110,4,FALSE),\"\")","v":"2021-12-21"},{"$f":"IFERROR(VLOOKUP(CONCATENATE($C$4,\"12\"),RS!$B$3:$S$110,17,FALSE),\"\")","v":3.5},null,null,null,null,null,null,null,null,null,null,null,null,null,null,null,null,null,null,null,null,null,null,null,null,null,""]
[]
[]
[]
[]
[null,null,null,null,null,null,null,null,null,null,null,null,"NO2,3-N","µg/l",null,null,null,"Årets resultat",null,null,null,null,null,null,null,null,null,null,null,null,null,null,null,null,null,null,null,null,null,null,null,null,null,"Årets resultat"]
[null,null,null,null,null,null,null,null,null,null,null,null,null,null,null,null,null,"Datum","µg/l",null,null,null,null,null,null,null,null,null,null,null,null,null,null,null,null,null,null,null,null,null,null,null,null,"Datum","µg/l"]
[null,null,null,null,null,null,null,null,null,null,null,null,"Medel",{"$f":"Statistik!M$145","v":5893.5877862595416},null,null,null,{"$f":"IFERROR(VLOOKUP(CONCATENATE($C$4,\"1\"),RS!$B$3:$S$110,4,FALSE),\"\")","v":"2021-01-25"},{"$f":"IFERROR(VLOOKUP(CONCATENATE($C$4,\"1\"),RS!$B$3:$S$110,14,FALSE),\"\")","v":8700},null,null,null,null,null,null,null,null,null,null,null,null,null,null,null,null,null,null,null,null,null,null,null,null,"2021-01-25",8700]
[null,null,null,null,null,null,null,null,null,null,null,null,"Std.avv.",{"$f":"Statistik!M$146","v":2702.832152420378},null,null,null,{"$f":"IFERROR(VLOOKUP(CONCATENATE($C$4,\"2\"),RS!$B$3:$S$110,4,FALSE),\"\")","v":"2021-02-22"},{"$f":"IFERROR(VLOOKUP(CONCATENATE($C$4,\"2\"),RS!$B$3:$S$110,14,FALSE),\"\")","v":6600},null,null,null,null,null,null,null,null,null,null,null,null,null,null,null,null,null,null,null,null,null,null,null,null,"2021-02-22",6600]
[null,null,null,null,null,null,null,null,null,null,null,null,"Max",{"$f":"Statistik!M$147","v":15000},null,null,null,{"$f":"IFERROR(VLOOKUP(CONCATENATE($C$4,\"3\"),RS!$B$3:$S$110,4,FALSE),\"\")","v":"2021-03-24"},{"$f":"IFERROR(VLOOKUP(CONCATENATE($C$4,\"3\"),RS!$B$3:$S$110,14,FALSE),\"\")","v":6200},null,null,null,null,null,null,null,null,null,null,null,null,null,null,null,null,null,null,null,null,null,null,null,null,"2021-03-24",6200]
[null,null,null,null,null,null,null,null,null,null,null,null,"Min",{"$f":"Statistik!M$148","v":10},null,null,null,{"$f":"IFERROR(VLOOKUP(CONCATENATE($C$4,\"4\"),RS!$B$3:$S$110,4,FALSE),\"\")","v":"2021-04-27"},{"$f":"IFERROR(VLOOKUP(CONCATENATE($C$4,\"4\"),RS!$B$3:$S$110,14,FALSE),\"\")","v":3700},null,null,null,null,null,null,null,null,null,null,null,null,null,null,null,null,null,null,null,null,null,null,null,null,"2021-04-27",3700]
[null,null,null,null,null,null,null,null,null,null,null,null,"Antal värden",{"$f":"Statistik!M$149","v":131},null,null,null,{"$f":"IFERROR(VLOOKUP(CONCATENATE($C$4,\"5\"),RS!$B$3:$S$110,4,FALSE),\"\")","v":"2021-05-25"},{"$f":"IFERROR(VLOOKUP(CONCATENATE($C$4,\"5\"),RS!$B$3:$S$110,14,FALSE),\"\")","v":4000},null,null,null,null,null,null,null,null,null,null,null,null,null,null,null,null,null,null,null,null,null,null,null,null,"2021-05-25",4000]
[null,null,null,null,null,null,null,null,null,null,null,null,null,null,null,null,null,{"$f":"IFERROR(VLOOKUP(CONCATENATE($C$4,\"6\"),RS!$B$3:$S$110,4,FALSE),\"\")","v":"2021-06-21"},{"$f":"IFERROR(VLOOKUP(CONCATENATE($C$4,\"6\"),RS!$B$3:$S$110,14,FALSE),\"\")","v":9500},null,null,null,null,null,null,null,null,null,null,null,null,null,null,null,null,null,null,null,null,null,null,null,null,"2021-06-21",9500]
[null,null,null,null,null,null,null,null,null,null,null,null,"Senaste",{"$f":"VLOOKUP(TRIM(CONCATENATE($C$4,$R$4)),RS!$A$3:$R$110,15,FALSE)","v":6600},null,null,null,{"$f":"IFERROR(VLOOKUP(CONCATENATE($C$4,\"7\"),RS!$B$3:$S$110,4,FALSE),\"\")","v":"2021-07-21"},{"$f":"IFERROR(VLOOKUP(CONCATENATE($C$4,\"7\"),RS!$B$3:$S$110,14,FALSE),\"\")","v":7200},null,null,null,null,null,null,null,null,null,null,null,null,null,null,null,null,null,null,null,null,null,null,null,null,null,""]
[null,null,null,null,null,null,null,null,null,null,null,null,null,null,null,null,null,{"$f":"IFERROR(VLOOKUP(CONCATENATE($C$4,\"8\"),RS!$B$3:$S$110,4,FALSE),\"\")","v":"2021-08-30"},{"$f":"IFERROR(VLOOKUP(CONCATENATE($C$4,\"8\"),RS!$B$3:$S$110,14,FALSE),\"\")","v":""},null,null,null,null,null,null,null,null,null,null,null,null,null,null,null,null,null,null,null,null,null,null,null,null,null,""]
[null,null,null,null,null,null,null,null,null,null,null,null,null,null,null,null,null,{"$f":"IFERROR(VLOOKUP(CONCATENATE($C$4,\"9\"),RS!$B$3:$S$110,4,FALSE),\"\")","v":"2021-09-29"},{"$f":"IFERROR(VLOOKUP(CONCATENATE($C$4,\"9\"),RS!$B$3:$S$110,14,FALSE),\"\")","v":4000},null,null,null,null,null,null,null,null,null,null,null,null,null,null,null,null,null,null,null,null,null,null,null,null,null,""]
[null,null,null,null,null,null,null,null,null,null,null,null,null,null,null,null,null,{"$f":"IFERROR(VLOOKUP(CONCATENATE($C$4,\"10\"),RS!$B$3:$S$110,4,FALSE),\"\")","v":"2021-10-20"},{"$f":"IFERROR(VLOOKUP(CONCATENATE($C$4,\"10\"),RS!$B$3:$S$110,14,FALSE),\"\")","v":7200},null,null,null,null,null,null,null,null,null,null,null,null,null,null,null,null,null,null,null,null,null,null,null,null,null,""]
[null,null,null,null,null,null,null,null,null,null,null,null,null,null,null,null,null,{"$f":"IFERROR(VLOOKUP(CONCATENATE($C$4,\"11\"),RS!$B$3:$S$110,4,FALSE),\"\")","v":"2021-11-24"},{"$f":"IFERROR(VLOOKUP(CONCATENATE($C$4,\"11\"),RS!$B$3:$S$110,14,FALSE),\"\")","v":6600},null,null,null,null,null,null,null,null,null,null,null,null,null,null,null,null,null,null,null,null,null,null,null,null,null,""]
[null,null,null,null,null,null,null,null,null,null,null,null,null,null,null,null,null,{"$f":"IFERROR(VLOOKUP(CONCATENATE($C$4,\"12\"),RS!$B$3:$S$110,4,FALSE),\"\")","v":"2021-12-21"},{"$f":"IFERROR(VLOOKUP(CONCATENATE($C$4,\"12\"),RS!$B$3:$S$110,14,FALSE),\"\")","v":7300},null,null,null,null,null,null,null,null,null,null,null,null,null,null,null,null,null,null,null,null,null,null,null,null,null,""]
[]
[]
[]
[]
[null,null,null,null,null,null,null,null,null,null,null,null,"NH4-N","µg/l",null,null,null,"Årets resultat",null,null,null,null,null,null,null,null,null,null,null,null,null,null,null,null,null,null,null,null,null,null,null,null,null,"Årets resultat"]
[null,null,null,null,null,null,null,null,null,null,null,null,null,null,null,null,null,"Datum","µg/l",null,null,null,null,null,null,null,null,null,null,null,null,null,null,null,null,null,null,null,null,null,null,null,null,"Datum","µg/l"]
[null,null,null,null,null,null,null,null,null,null,null,null,"Medel",{"$f":"Statistik!N$145","v":432.76335877862596},null,null,null,{"$f":"IFERROR(VLOOKUP(CONCATENATE($C$4,\"1\"),RS!$B$3:$S$110,4,FALSE),\"\")","v":"2021-01-25"},{"$f":"IFERROR(VLOOKUP(CONCATENATE($C$4,\"1\"),RS!$B$3:$S$110,15,FALSE),\"\")","v":290},null,null,null,null,null,null,null,null,null,null,null,null,null,null,null,null,null,null,null,null,null,null,null,null,"2021-01-25",290]
[null,null,null,null,null,null,null,null,null,null,null,null,"Std.avv.",{"$f":"Statistik!N$146","v":1409.6770542987229},null,null,null,{"$f":"IFERROR(VLOOKUP(CONCATENATE($C$4,\"2\"),RS!$B$3:$S$110,4,FALSE),\"\")","v":"2021-02-22"},{"$f":"IFERROR(VLOOKUP(CONCATENATE($C$4,\"2\"),RS!$B$3:$S$110,15,FALSE),\"\")","v":160},null,null,null,null,null,null,null,null,null,null,null,null,null,null,null,null,null,null,null,null,null,null,null,null,"2021-02-22",160]
[null,null,null,null,null,null,null,null,null,null,null,null,"Max",{"$f":"Statistik!N$147","v":12000},null,null,null,{"$f":"IFERROR(VLOOKUP(CONCATENATE($C$4,\"3\"),RS!$B$3:$S$110,4,FALSE),\"\")","v":"2021-03-24"},{"$f":"IFERROR(VLOOKUP(CONCATENATE($C$4,\"3\"),RS!$B$3:$S$110,15,FALSE),\"\")","v":610},null,null,null,null,null,null,null,null,null,null,null,null,null,null,null,null,null,null,null,null,null,null,null,null,"2021-03-24",610]
[null,null,null,null,null,null,null,null,null,null,null,null,"Min",{"$f":"Statistik!N$148","v":10},null,null,null,{"$f":"IFERROR(VLOOKUP(CONCATENATE($C$4,\"4\"),RS!$B$3:$S$110,4,FALSE),\"\")","v":"2021-04-27"},{"$f":"IFERROR(VLOOKUP(CONCATENATE($C$4,\"4\"),RS!$B$3:$S$110,15,FALSE),\"\")","v":600},null,null,null,null,null,null,null,null,null,null,null,null,null,null,null,null,null,null,null,null,null,null,null,null,"2021-04-27",600]
[null,null,null,null,null,null,null,null,null,null,null,null,"Antal värden",{"$f":"Statistik!N$149","v":131},null,null,null,{"$f":"IFERROR(VLOOKUP(CONCATENATE($C$4,\"5\"),RS!$B$3:$S$110,4,FALSE),\"\")","v":"2021-05-25"},{"$f":"IFERROR(VLOOKUP(CONCATENATE($C$4,\"5\"),RS!$B$3:$S$110,15,FALSE),\"\")","v":67},null,null,null,null,null,null,null,null,null,null,null,null,null,null,null,null,null,null,null,null,null,null,null,null,"2021-05-25",67]
[null,null,null,null,null,null,null,null,null,null,null,null,null,null,null,null,null,{"$f":"IFERROR(VLOOKUP(CONCATENATE($C$4,\"6\"),RS!$B$3:$S$110,4,FALSE),\"\")","v":"2021-06-21"},{"$f":"IFERROR(VLOOKUP(CONCATENATE($C$4,\"6\"),RS!$B$3:$S$110,15,FALSE),\"\")","v":110},null,null,null,null,null,null,null,null,null,null,null,null,null,null,null,null,null,null,null,null,null,null,null,null,"2021-06-21",110]
[null,null,null,null,null,null,null,null,null,null,null,null,"Senaste",{"$f":"VLOOKUP(TRIM(CONCATENATE($C$4,$R$4)),RS!$A$3:$R$110,16,FALSE)","v":350},null,null,null,{"$f":"IFERROR(VLOOKUP(CONCATENATE($C$4,\"7\"),RS!$B$3:$S$110,4,FALSE),\"\")","v":"2021-07-21"},{"$f":"IFERROR(VLOOKUP(CONCATENATE($C$4,\"7\"),RS!$B$3:$S$110,15,FALSE),\"\")","v":110},null,null,null,null,null,null,null,null,null,null,null,null,null,null,null,null,null,null,null,null,null,null,null,null,null,""]
[null,null,null,null,null,null,null,null,null,null,null,null,null,null,null,null,null,{"$f":"IFERROR(VLOOKUP(CONCATENATE($C$4,\"8\"),RS!$B$3:$S$110,4,FALSE),\"\")","v":"2021-08-30"},{"$f":"IFERROR(VLOOKUP(CONCATENATE($C$4,\"8\"),RS!$B$3:$S$110,15,FALSE),\"\")","v":""},null,null,null,null,null,null,null,null,null,null,null,null,null,null,null,null,null,null,null,null,null,null,null,null,null,""]
[null,null,null,null,null,null,null,null,null,null,null,null,null,null,null,null,null,{"$f":"IFERROR(VLOOKUP(CONCATENATE($C$4,\"9\"),RS!$B$3:$S$110,4,FALSE),\"\")","v":"2021-09-29"},{"$f":"IFERROR(VLOOKUP(CONCATENATE($C$4,\"9\"),RS!$B$3:$S$110,15,FALSE),\"\")","v":110},null,null,null,null,null,null,null,null,null,null,null,null,null,null,null,null,null,null,null,null,null,null,null,null,null,""]
[null,null,null,null,null,null,null,null,null,null,null,null,null,null,null,null,null,{"$f":"IFERROR(VLOOKUP(CONCATENATE($C$4,\"10\"),RS!$B$3:$S$110,4,FALSE),\"\")","v":"2021-10-20"},{"$f":"IFERROR(VLOOKUP(CONCATENATE($C$4,\"10\"),RS!$B$3:$S$110,15,FALSE),\"\")","v":"<10"},null,null,null,null,null,null,null,null,null,null,null,null,null,null,null,null,null,null,null,null,null,null,null,null,null,""]
[null,null,null,null,null,null,null,null,null,null,null,null,null,null,null,null,null,{"$f":"IFERROR(VLOOKUP(CONCATENATE($C$4,\"11\"),RS!$B$3:$S$110,4,FALSE),\"\")","v":"2021-11-24"},{"$f":"IFERROR(VLOOKUP(CONCATENATE($C$4,\"11\"),RS!$B$3:$S$110,15,FALSE),\"\")","v":350},null,null,null,null,null,null,null,null,null,null,null,null,null,null,null,null,null,null,null,null,null,null,null,null,null,""]
[null,null,null,null,null,null,null,null,null,null,null,null,null,null,null,null,null,{"$f":"IFERROR(VLOOKUP(CONCATENATE($C$4,\"12\"),RS!$B$3:$S$110,4,FALSE),\"\")","v":"2021-12-21"},{"$f":"IFERROR(VLOOKUP(CONCATENATE($C$4,\"12\"),RS!$B$3:$S$110,15,FALSE),\"\")","v":400},null,null,null,null,null,null,null,null,null,null,null,null,null,null,null,null,null,null,null,null,null,null,null,null,null,""]
[]
[]
[]
[]
[null,null,null,null,null,null,null,null,null,null,null,null,"PO4-P","µg/l",null,null,null,"Årets resultat",null,null,null,null,null,null,null,null,null,null,null,null,null,null,null,null,null,null,null,null,null,null,null,null,null,"Årets resultat"]
[null,null,null,null,null,null,null,null,null,null,null,null,null,null,null,null,null,"Datum","µg/l",null,null,null,null,null,null,null,null,null,null,null,null,null,null,null,null,null,null,null,null,null,null,null,null,"Datum","µg/l"]
[null,null,null,null,null,null,null,null,null,null,null,null,"Medel",{"$f":"Statistik!J$145","v":53.603816793893131},null,null,null,{"$f":"IFERROR(VLOOKUP(CONCATENATE($C$4,\"1\"),RS!$B$3:$S$110,4,FALSE),\"\")","v":"2021-01-25"},{"$f":"IFERROR(VLOOKUP(CONCATENATE($C$4,\"1\"),RS!$B$3:$S$110,11,FALSE),\"\")","v":28},null,null,null,null,null,null,null,null,null,null,null,null,null,null,null,null,null,null,null,null,null,null,null,null,"2021-01-25",28]
[null,null,null,null,null,null,null,null,null,null,null,null,"Std.avv.",{"$f":"Statistik!J$146","v":71.570621824858733},null,null,null,{"$f":"IFERROR(VLOOKUP(CONCATENATE($C$4,\"2\"),RS!$B$3:$S$110,4,FALSE),\"\")","v":"2021-02-22"},{"$f":"IFERROR(VLOOKUP(CONCATENATE($C$4,\"2\"),RS!$B$3:$S$110,11,FALSE),\"\")","v":32},null,null,null,null,null,null,null,null,null,null,null,null,null,null,null,null,null,null,null,null,null,null,null,null,"2021-02-22",32]
[null,null,null,null,null,null,null,null,null,null,null,null,"Max",{"$f":"Statistik!J$147","v":470},null,null,null,{"$f":"IFERROR(VLOOKUP(CONCATENATE($C$4,\"3\"),RS!$B$3:$S$110,4,FALSE),\"\")","v":"2021-03-24"},{"$f":"IFERROR(VLOOKUP(CONCATENATE($C$4,\"3\"),RS!$B$3:$S$110,11,FALSE),\"\")","v":16},null,null,null,null,null,null,null,null,null,null,null,null,null,null,null,null,null,null,null,null,null,null,null,null,"2021-03-24",16]
[null,null,null,null,null,null,null,null,null,null,null,null,"Min",{"$f":"Statistik!J$148","v":2},null,null,null,{"$f":"IFERROR(VLOOKUP(CONCATENATE($C$4,\"4\"),RS!$B$3:$S$110,4,FALSE),\"\")","v":"2021-04-27"},{"$f":"IFERROR(VLOOKUP(CONCATENATE($C$4,\"4\"),RS!$B$3:$S$110,11,FALSE),\"\")","v":7.8},null,null,null,null,null,null,null,null,null,null,null,null,null,null,null,null,null,null,null,null,null,null,null,null,"2021-04-27",7.8]
[null,null,null,null,null,null,null,null,null,null,null,null,"Antal värden",{"$f":"Statistik!J$149","v":131},null,null,null,{"$f":"IFERROR(VLOOKUP(CONCATENATE($C$4,\"5\"),RS!$B$3:$S$110,4,FALSE),\"\")","v":"2021-05-25"},{"$f":"IFERROR(VLOOKUP(CONCATENATE($C$4,\"5\"),RS!$B$3:$S$110,11,FALSE),\"\")","v":14},null,null,null,null,null,null,null,null,null,null,null,null,null,null,null,null,null,null,null,null,null,null,null,null,"2021-05-25",14]
[null,null,null,null,null,null,null,null,null,null,null,null,null,null,null,null,null,{"$f":"IFERROR(VLOOKUP(CONCATENATE($C$4,\"6\"),RS!$B$3:$S$110,4,FALSE),\"\")","v":"2021-06-21"},{"$f":"IFERROR(VLOOKUP(CONCATENATE($C$4,\"6\"),RS!$B$3:$S$110,11,FALSE),\"\")","v":72},null,null,null,null,null,null,null,null,null,null,null,null,null,null,null,null,null,null,null,null,null,null,null,null,"2021-06-21",72]
[null,null,null,null,null,null,null,null,null,null,null,null,"Senaste",{"$f":"VLOOKUP(TRIM(CONCATENATE($C$4,$R$4)),RS!$A$3:$R$110,12,FALSE)","v":45},null,null,null,{"$f":"IFERROR(VLOOKUP(CONCATENATE($C$4,\"7\"),RS!$B$3:$S$110,4,FALSE),\"\")","v":"2021-07-21"},{"$f":"IFERROR(VLOOKUP(CONCATENATE($C$4,\"7\"),RS!$B$3:$S$110,11,FALSE),\"\")","v":72},null,null,null,null,null,null,null,null,null,null,null,null,null,null,null,null,null,null,null,null,null,null,null,null,null,""]
[null,null,null,null,null,null,null,null,null,null,null,null,null,null,null,null,null,{"$f":"IFERROR(VLOOKUP(CONCATENATE($C$4,\"8\"),RS!$B$3:$S$110,4,FALSE),\"\")","v":"2021-08-30"},{"$f":"IFERROR(VLOOKUP(CONCATENATE($C$4,\"8\"),RS!$B$3:$S$110,11,FALSE),\"\")","v":""},null,null,null,null,null,null,null,null,null,null,null,null,null,null,null,null,null,null,null,null,null,null,null,null,null,""]
[null,null,null,null,null,null,null,null,null,null,null,null,null,null,null,null,null,{"$f":"IFERROR(VLOOKUP(CONCATENATE($C$4,\"9\"),RS!$B$3:$S$110,4,FALSE),\"\")","v":"2021-09-29"},{"$f":"IFERROR(VLOOKUP(CONCATENATE($C$4,\"9\"),RS!$B$3:$S$110,11,FALSE),\"\")","v":33},null,null,null,null,null,null,null,null,null,null,null,null,null,null,null,null,null,null,null,null,null,null,null,null,null,""]
[null,null,null,null,null,null,null,null,null,null,null,null,null,null,null,null,null,{"$f":"IFERROR(VLOOKUP(CONCATENATE($C$4,\"10\"),RS!$B$3:$S$110,4,FALSE),\"\")","v":"2021-10-20"},{"$f":"IFERROR(VLOOKUP(CONCATENATE($C$4,\"10\"),RS!$B$3:$S$110,11,FALSE),\"\")","v":30},null,null,null,null,null,null,null,null,null,null,null,null,null,null,null,null,null,null,null,null,null,null,null,null,null,""]
[null,null,null,null,null,null,null,null,null,null,null,null,null,null,null,null,null,{"$f":"IFERROR(VLOOKUP(CONCATENATE($C$4,\"11\"),RS!$B$3:$S$110,4,FALSE),\"\")","v":"2021-11-24"},{"$f":"IFERROR(VLOOKUP(CONCATENATE($C$4,\"11\"),RS!$B$3:$S$110,11,FALSE),\"\")","v":45},null,null,null,null,null,null,null,null,null,null,null,null,null,null,null,null,null,null,null,null,null,null,null,null,null,""]
[null,null,null,null,null,null,null,null,null,null,null,null,null,null,null,null,null,{"$f":"IFERROR(VLOOKUP(CONCATENATE($C$4,\"12\"),RS!$B$3:$S$110,4,FALSE),\"\")","v":"2021-12-21"},{"$f":"IFERROR(VLOOKUP(CONCATENATE($C$4,\"12\"),RS!$B$3:$S$110,11,FALSE),\"\")","v":23},null,null,null,null,null,null,null,null,null,null,null,null,null,null,null,null,null,null,null,null,null,null,null,null,null,""]
[]
[]
[]
[]
[null,null,null,null,null,null,null,null,null,null,null,null,"Part-P","µg/l",null,null,null,"Årets resultat",null,null,null,null,null,null,null,null,null,null,null,null,null,null,null,null,null,null,null,null,null,null,null,null,null,"Årets resultat"]
[null,null,null,null,null,null,null,null,null,null,null,null,null,null,null,null,null,"Datum","µg/l",null,null,null,null,null,null,null,null,null,null,null,null,null,null,null,null,null,null,null,null,null,null,null,null,"Datum","µg/l"]
[null,null,null,null,null,null,null,null,null,null,null,null,"Medel",{"$f":"Statistik!L$145","v":23},null,null,null,{"$f":"IFERROR(VLOOKUP(CONCATENATE($C$4,\"1\"),RS!$B$3:$S$110,4,FALSE),\"\")","v":"2021-01-25"},{"$f":"IFERROR(VLOOKUP(CONCATENATE($C$4,\"1\"),RS!$B$3:$S$110,13,FALSE),\"\")","v":""},null,null,null,null,null,null,null,null,null,null,null,null,null,null,null,null,null,null,null,null,null,null,null,null,"2021-01-25",""]
[null,null,null,null,null,null,null,null,null,null,null,null,"Std.avv.",{"$f":"Statistik!L$146","v":11.313708498984761},null,null,null,{"$f":"IFERROR(VLOOKUP(CONCATENATE($C$4,\"2\"),RS!$B$3:$S$110,4,FALSE),\"\")","v":"2021-02-22"},{"$f":"IFERROR(VLOOKUP(CONCATENATE($C$4,\"2\"),RS!$B$3:$S$110,13,FALSE),\"\")","v":""},null,null,null,null,null,null,null,null,null,null,null,null,null,null,null,null,null,null,null,null,null,null,null,null,"2021-02-22",""]
[null,null,null,null,null,null,null,null,null,null,null,null,"Max",{"$f":"Statistik!L$147","v":31},null,null,null,{"$f":"IFERROR(VLOOKUP(CONCATENATE($C$4,\"3\"),RS!$B$3:$S$110,4,FALSE),\"\")","v":"2021-03-24"},{"$f":"IFERROR(VLOOKUP(CONCATENATE($C$4,\"3\"),RS!$B$3:$S$110,13,FALSE),\"\")","v":""},null,null,null,null,null,null,null,null,null,null,null,null,null,null,null,null,null,null,null,null,null,null,null,null,"2021-03-24",""]
[null,null,null,null,null,null,null,null,null,null,null,null,"Min",{"$f":"Statistik!L$148","v":15},null,null,null,{"$f":"IFERROR(VLOOKUP(CONCATENATE($C$4,\"4\"),RS!$B$3:$S$110,4,FALSE),\"\")","v":"2021-04-27"},{"$f":"IFERROR(VLOOKUP(CONCATENATE($C$4,\"4\"),RS!$B$3:$S$110,13,FALSE),\"\")","v":""},null,null,null,null,null,null,null,null,null,null,null,null,null,null,null,null,null,null,null,null,null,null,null,null,"2021-04-27",""]
[null,null,null,null,null,null,null,null,null,null,null,null,"Antal värden",{"$f":"Statistik!L$149","v":14},null,null,null,{"$f":"IFERROR(VLOOKUP(CONCATENATE($C$4,\"5\"),RS!$B$3:$S$110,4,FALSE),\"\")","v":"2021-05-25"},{"$f":"IFERROR(VLOOKUP(CONCATENATE($C$4,\"5\"),RS!$B$3:$S$110,13,FALSE),\"\")","v":""},null,null,null,null,null,null,null,null,null,null,null,null,null,null,null,null,null,null,null,null,null,null,null,null,"2021-05-25",""]
[null,null,null,null,null,null,null,null,null,null,null,null,null,null,null,null,null,{"$f":"IFERROR(VLOOKUP(CONCATENATE($C$4,\"6\"),RS!$B$3:$S$110,4,FALSE),\"\")","v":"2021-06-21"},{"$f":"IFERROR(VLOOKUP(CONCATENATE($C$4,\"6\"),RS!$B$3:$S$110,13,FALSE),\"\")","v":""},null,null,null,null,null,null,null,null,null,null,null,null,null,null,null,null,null,null,null,null,null,null,null,null,"2021-06-21",""]
[null,null,null,null,null,null,null,null,null,null,null,null,"Senaste",{"$f":"VLOOKUP(TRIM(CONCATENATE($C$4,$R$4)),RS!$A$3:$R$110,14,FALSE)","v":""},null,null,null,{"$f":"IFERROR(VLOOKUP(CONCATENATE($C$4,\"7\"),RS!$B$3:$S$110,4,FALSE),\"\")","v":"2021-07-21"},{"$f":"IFERROR(VLOOKUP(CONCATENATE($C$4,\"7\"),RS!$B$3:$S$110,13,FALSE),\"\")","v":""},null,null,null,null,null,null,null,null,null,null,null,null,null,null,null,null,null,null,null,null,null,null,null,null,null,""]
[null,null,null,null,null,null,null,null,null,null,null,null,null,null,null,null,null,{"$f":"IFERROR(VLOOKUP(CONCATENATE($C$4,\"8\"),RS!$B$3:$S$110,4,FALSE),\"\")","v":"2021-08-30"},{"$f":"IFERROR(VLOOKUP(CONCATENATE($C$4,\"8\"),RS!$B$3:$S$110,13,FALSE),\"\")","v":""},null,null,null,null,null,null,null,null,null,null,null,null,null,null,null,null,null,null,null,null,null,null,null,null,null,""]
[null,null,null,null,null,null,null,null,null,null,null,null,null,null,null,null,null,{"$f":"IFERROR(VLOOKUP(CONCATENATE($C$4,\"9\"),RS!$B$3:$S$110,4,FALSE),\"\")","v":"2021-09-29"},{"$f":"IFERROR(VLOOKUP(CONCATENATE($C$4,\"9\"),RS!$B$3:$S$110,13,FALSE),\"\")","v":""},null,null,null,null,null,null,null,null,null,null,null,null,null,null,null,null,null,null,null,null,null,null,null,null,null,""]
[null,null,null,null,null,null,null,null,null,null,null,null,null,null,null,null,null,{"$f":"IFERROR(VLOOKUP(CONCATENATE($C$4,\"10\"),RS!$B$3:$S$110,4,FALSE),\"\")","v":"2021-10-20"},{"$f":"IFERROR(VLOOKUP(CONCATENATE($C$4,\"10\"),RS!$B$3:$S$110,13,FALSE),\"\")","v":""},null,null,null,null,null,null,null,null,null,null,null,null,null,null,null,null,null,null,null,null,null,null,null,null,null,""]
[null,null,null,null,null,null,null,null,null,null,null,null,null,null,null,null,null,{"$f":"IFERROR(VLOOKUP(CONCATENATE($C$4,\"11\"),RS!$B$3:$S$110,4,FALSE),\"\")","v":"2021-11-24"},{"$f":"IFERROR(VLOOKUP(CONCATENATE($C$4,\"11\"),RS!$B$3:$S$110,13,FALSE),\"\")","v":""},null,null,null,null,null,null,null,null,null,null,null,null,null,null,null,null,null,null,null,null,null,null,null,null,null,""]
[null,null,null,null,null,null,null,null,null,null,null,null,null,null,null,null,null,{"$f":"IFERROR(VLOOKUP(CONCATENATE($C$4,\"12\"),RS!$B$3:$S$110,4,FALSE),\"\")","v":"2021-12-21"},{"$f":"IFERROR(VLOOKUP(CONCATENATE($C$4,\"12\"),RS!$B$3:$S$110,13,FALSE),\"\")","v":""},null,null,null,null,null,null,null,null,null,null,null,null,null,null,null,null,null,null,null,null,null,null,null,null,null,""]

{"sheet":"Hist_data","index":8,"n_rows":1194,"n_cols":19,"rows_kept":1194,"cut":false,"hidden":true,"merged":[]}
[null,null,"sista rad",1086,"OBS! Om det blir fler än 2000 rader måste makro ändras"]
[null,"Saxån-Braån"]
[null,"Vattenkontroll - historiska data"]
[null,null,null,"  °C","mg/l","%",null,"  FNU","mg/l","mg/l"," µg/l"," µg/l","  µg/l","  µg/l",null,"  µg/l"]
["Sorterings-","Provtagningspunkt","Datum"," Temp"," Syreh","Syrem","  pH","Gruml","Kond","PO4-P","Tot-P","Part.-P"," NO3+2-N","NH4-N"," Tot-N","Susp","Anmärkning","år","månad"]
[null,"Denna rad ska vara tom"]
[1,"14 Svalövsbäcken uppstr Svalöv","2010-01-26",0,15.2,103.82513661202184,7.92,8.6,47.7,27,31,20,3100,90,3800,"<5",null,{"$f":"YEAR(C7)","v":2010},{"$f":"MONTH(C7)","v":1}]
[1,"14 Svalövsbäcken uppstr Svalöv","2010-02-22",1,13.4,94.184448019320072,7.93,7.7,49.7,32,38,12,2500,130,2900,"<5",null,2010,2]
[1,"14 Svalövsbäcken uppstr Svalöv","2010-03-24",2.2000000000000002,12.6,91.59331135981617,7.49,13,28.3,37,61,30,5300,49,6400,6.1,null,2010,3]
[1,"14 Svalövsbäcken uppstr Svalöv","2010-04-27",10,7.6,67.556419026876398,8.1999999999999993,6.8,38.799999999999997,5,26,19,1800,11,2500,5.9,null,2010,4]
[1,"14 Svalövsbäcken uppstr Svalöv","2010-05-27",15.2,11,109.88299171889082,8.4,10.5,41.8,4,41,29,1200,20,2000,8.6,null,2010,5]
[1,"14 Svalövsbäcken uppstr Svalöv","2010-06-23",18.3,12.15,129.25457401795592,9.31,18,38.200000000000003,8,68,42,1300,18,2600,31,null,2010,6]
[1,"14 Svalövsbäcken uppstr Svalöv","2010-07-19",21.3,7.52,84.629139123013914,8.1300000000000008,12.5,41,42,92,51,23,"<10",930,12,null,2010,7]
[1,"14 Svalövsbäcken uppstr Svalöv","2010-08-25",20.2,10.9,120.22583137426359,8.5399999999999991,12,39.700000000000003,7,85,57,2400,16,3000,16,null,2010,8]
[1,"14 Svalövsbäcken uppstr Svalöv","2010-09-28",11.5,10.34,95.196039753501111,8.27,11,48,5,40,34,4100,13,4700,13,null,2010,9]
[1,"14 Svalövsbäcken uppstr Svalöv","2010-10-26",6.9,10.7,88.131178509402503,7.4,45,39.200000000000003,64,110,69,9600,13,9400,9.9,null,2010,10]
[1,"14 Svalövsbäcken uppstr Svalöv","2010-11-23",4.5,11.4,88.216785326073889,7.5,94,37.4,49,190,130,6400,"<10",7300,33,null,2010,11]
[1,"14 Svalövsbäcken uppstr Svalöv","2010-12-21",0.8,13,90.855562703350202,7.71,4.0999999999999996,42.9,16,21,"<21",4000,70,4700,"<5",null,2010,12]
[1,"14 Svalövsbäcken uppstr Svalöv","2011-01-27",1.3,12.9,91.442388370539376,7.45,15,33.1,31,51,23,4700,54,5500,"<5",null,2011,1]
[1,"14 Svalövsbäcken uppstr Svalöv","2011-02-24",1,13.8,96.995924079598268,7.81,4.5,36.700000000000003,16,30,8,3800,38,4700,"<5",null,2011,2]
[1,"14 Svalövsbäcken uppstr Svalöv","2011-03-29",5.0999999999999996,13.3,104.56634012332555,8.26,5.75,35.25,5,28,20,2900,"<10",3800,"<5",null,2011,3]
[1,"14 Svalövsbäcken uppstr Svalöv","2011-04-27",15.2,10.8,107.88511914218373,8.33,5.6,39.5,4,29,19,1700,33,2500,7.3,null,2011,4]
[1,"14 Svalövsbäcken uppstr Svalöv","2011-05-24",15.1,8.4,83.733588602773239,8.18,6.9,43.3,8,42,24,840,110,1700,"<5",null,2011,5]
[1,"14 Svalövsbäcken uppstr Svalöv","2011-06-28",19,10.6,114.30163119823884,8.73,14,38.200000000000003,7,62,38,540,49,1800,"<5",null,2011,6]
[1,"14 Svalövsbäcken uppstr Svalöv","2011-07-27",16.600000000000001,10.9,112.09148481198463,8.16,15,37.299999999999997,11,82,60,1600,"<10",2700,17,null,2011,7]
[1,"14 Svalövsbäcken uppstr Svalöv","2011-08-30",14.4,9.5,93.29527065594641,7.88,19,42.4,13,79,62,4100,"<10",5000,16,null,2011,8]
[1,"14 Svalövsbäcken uppstr Svalöv","2011-09-27",13.7,9.1,88.020328375517082,8.07,6.8,44.4,18,31,18,2400,18,3200,7.9,null,2011,9]
[1,"14 Svalövsbäcken uppstr Svalöv","2011-10-26",8.1,11,93.370394992919927,8.07,5.8,43.3,20,36,11,3400,28,4100,"<5",null,2011,10]
[1,"14 Svalövsbäcken uppstr Svalöv","2011-11-29",5.5,12.2,96.928629993179044,8.17,8,44.4,23,47,19,2100,52,2800,5.7,null,2011,11]
[1,"14 Svalövsbäcken uppstr Svalöv","2011-12-22",3.8,12,91.134997221088355,7.81,4.3,42,16,29,12,4900,30,5200,"<5",null,2011,12]
[1,"14 Svalövsbäcken uppstr Svalöv","2012-01-27",1.9,13.3,95.877998763002509,7.74,4.9000000000000004,41.3,14,27,12,4300,36,5300,"<5",null,2012,1]
[1,"14 Svalövsbäcken uppstr Svalöv","2012-02-28",2.5,12.3,90.158134675058506,7.49,13,31,28,55,17,3900,76,5100,"<5",null,2012,2]
[1,"14 Svalövsbäcken uppstr Svalöv","2012-03-29",8.4,11.4,97.485227471104423,8.2899999999999991,6.6,37.5,5,26,19,2300,11,2900,6.5,null,2012,3]
[1,"14 Svalövsbäcken uppstr Svalöv","2012-04-25",10,10.7,95.112326787839137,8.31,8.1999999999999993,39.4,3,23,12,1300,21,2200,8.5,null,2012,4]
[1,"14 Svalövsbäcken uppstr Svalöv","2012-05-29",18,7.2,76.146578412988646,8.14,8.14,44.5,6,45,25,620,71,1300,"<5",null,2012,5]
[1,"14 Svalövsbäcken uppstr Svalöv","2012-06-26",15.5,9,90.472996598655612,7.92,12,44.7,16,77,42,300,58,1100,19,null,2012,6]
[1,"14 Svalövsbäcken uppstr Svalöv","2012-07-25",19.8,7.3,79.919764561415491,8.35,14,41.3,17,82,60,"<10","<10",840,9.8000000000000007,null,2012,7]
[1,"14 Svalövsbäcken uppstr Svalöv","2012-08-27",20.100000000000001,8.5,93.580097900857311,8.08,13,44.3,17,77,45,190,23,1300,6.8,null,2012,8]
[1,"14 Svalövsbäcken uppstr Svalöv","2012-09-24",12.7,9,85.147575329643615,8.06,10,45.8,9,66,13,140,40,1200,9.5,null,2012,9]
[1,"14 Svalövsbäcken uppstr Svalöv","2012-10-30",5.3,11.6,91.680853511533982,7.91,18,42.5,23,59,42,3600,21,4000,13,null,2012,10]
[1,"14 Svalövsbäcken uppstr Svalöv","2012-11-25",5.0999999999999996,12.1,95.131783119717213,7.3,50,30.9,74,150,61,8900,16,9100,28,null,2012,11]
[1,"14 Svalövsbäcken uppstr Svalöv","2012-11-28",6.7,12.6,103.25396072672115,7.49,25,39,35,52,19,6500,25,7400,9.1999999999999993,null,2012,11]
[1,"14 Svalövsbäcken uppstr Svalöv","2012-12-20",2.8,12.9,95.340351015115189,7.31,11,38,23,49,18,6500,30,7300,"<5",null,2012,12]
[1,"14 Svalövsbäcken uppstr Svalöv","2013-01-30",2.2000000000000002,13.6,98.862621785198399,7.82,6.9,44.2,22,34,13,3600,62,4300,6,null,2013,1]
[1,"14 Svalövsbäcken uppstr Svalöv","2013-02-26",2.1,12.9,93.513957285489084,7.88,2.6,40.700000000000003,8,19,6,3900,17,4200,"<5","is på sjön",2013,2]
[1,"14 Svalövsbäcken uppstr Svalöv","2013-03-26",1.7,15.4,110.39771406059431,8.1999999999999993,3.5,42.9,3,12,7,3300,"<10",3900,"<5",null,2013,3]
[1,"14 Svalövsbäcken uppstr Svalöv","2013-04-25",9.6,12,105.65337512227673,8.32,12,36.1,3,26,16,1400,"<10",2200,11,null,2013,4]
[1,"14 Svalövsbäcken uppstr Svalöv","2013-05-29",14.9,9.6999999999999993,96.28323745531155,7.87,12,41.2,9,59,44,740,34,1800,11,null,2013,5]
[1,"14 Svalövsbäcken uppstr Svalöv","2013-06-26",17.399999999999999,7.8,81.517206085538234,8.14,29.5,43.9,7,82,59,36,40,1100,24,null,2013,6]
[1,"14 Svalövsbäcken uppstr Svalöv","2013-07-25",21.7,6.7,75.942863128817365,8.0399999999999991,13.7,44.8,22,98,61,16,"<10",1000,14,null,2013,7]
[1,"14 Svalövsbäcken uppstr Svalöv","2013-08-27",17.5,7.2,75.396859094648192,8.0500000000000007,20,39.200000000000003,28,64,20,150,38,2000,16,null,2013,8]
[1,"14 Svalövsbäcken uppstr Svalöv","2013-09-26",11.4,8.6,78.994380884949607,7.83,6.4,42.8,3,50,27,110,41,1200,8.6,null,2013,9]
[1,"14 Svalövsbäcken uppstr Svalöv","2013-10-29",10.8,9.9,89.677208946851422,8.0299999999999994,12,44.9,22,55,22,6200,33,6900,14,null,2013,10]
[1,"14 Svalövsbäcken uppstr Svalöv","2013-11-27",3.9,12.1,92.142302100835565,7.74,3,44.6,15,29,6,5800,24,6800,"<5",null,2013,11]
[1,"14 Svalövsbäcken uppstr Svalöv","2013-12-23",5.3,12.3,97.213318809643795,7.67,8.4,38.6,18,34,12,6800,19,6700,5.6,null,2013,12]
[1,"14 Svalövsbäcken uppstr Svalöv","2014-01-28",0.3,14.2,97.83494495940171,7.75,3.3,41.1,16,26,5,4500,32,5300,"<5",null,2014,1]
[1,"14 Svalövsbäcken uppstr Svalöv","2014-02-27",4.2,12.8,98.260694382434238,7.81,8,36.700000000000003,16,40,14,5200,21,5700,"<5",null,2014,2]
[1,"14 Svalövsbäcken uppstr Svalöv","2014-03-27",5.0999999999999996,12.6,99.062848537887348,7.99,7,37.6,10,27,12,2300,17,3100,6.4,null,2014,3]
[1,"14 Svalövsbäcken uppstr Svalöv","2014-04-29",13.1,10,95.455622401836834,8.2100000000000009,8.1,40.6,3,26,13,2200,29,3100,6.3,null,2014,4]
[1,"14 Svalövsbäcken uppstr Svalöv","2014-05-28",15.9,8.5,86.161971842246089,7.69,8.1999999999999993,40.9,7.1,40,18,2800,48,4200,14,null,2014,5]
[1,"14 Svalövsbäcken uppstr Svalöv","2014-06-24",16.899999999999999,8.6,88.979397827932033,8.0299999999999994,16,46.4,5,50,22,720,130,1900,16,"gröngrumligt",2014,6]
[1,"14 Svalövsbäcken uppstr Svalöv","2014-07-21",21.6,7.5,84.85923849612081,7.93,11,45.3,13,85,50,380,14,970,9.6999999999999993,null,2014,7]
[1,"14 Svalövsbäcken uppstr Svalöv","2014-08-28",16.899999999999999,8.8000000000000007,91.048686149511866,8.25,13,44.6,4.2,85,59,"<10","<10",1100,13,null,2014,8]
[1,"14 Svalövsbäcken uppstr Svalöv","2014-09-30",13.3,8.4,80.538430257419265,7.96,7.3,47.3,14,49,23,50,32,790,6.4,null,2014,9]
[1,"14 Svalövsbäcken uppstr Svalöv","2014-10-29",10.5,10.1,90.847386767957744,7.8650000000000002,12.8,45.8,30,56,21,7100,37,8300,10,null,2014,10]
[1,"14 Svalövsbäcken uppstr Svalöv","2014-11-27",6.1,11.7,94.414762364347027,8,7.2,48,20,39,7,5200,31,5800,5.3,null,2014,11]
[1,"14 Svalövsbäcken uppstr Svalöv","2014-12-22",6.5,10.9,88.867745921600374,7.38,147,29.8,59,260,190,7000,"<10",7900,65,null,2014,12]
[1,"14 Svalövsbäcken uppstr Svalöv","2015-01-27",3.7,12.2,92.404228004632216,7.53,68,33.4,48,99,56,6500,"<10",7400,15,null,2015,1]
[1,"14 Svalövsbäcken uppstr Svalöv","2015-02-24",3.6,12.8,96.686954538075241,7.58,21,37,24,44,17,6000,"<10",6400,8.6,null,2015,2]
[1,"14 Svalövsbäcken uppstr Svalöv","2015-03-31",7.2,10.5,87.143071121421684,7.32,50,34.9,64,150,92,12000,94,13000,16,null,2015,3]
[1,"14 Svalövsbäcken uppstr Svalöv","2015-04-29",9.6999999999999993,10.8,95.316257118282564,7.97,7.1,38.799999999999997,10,34,14,3300,29,3900,8.6999999999999993,null,{"$f":"YEAR(C71)","v":2015},{"$f":"MONTH(C71)","v":4}]
[1,"14 Svalövsbäcken uppstr Svalöv","2015-05-27",12.7,10.1,95.55450120326671,8.16,15,39.5,6.5,47,35,520,12,3400,18,null,2015,5]
[1,"14 Svalövsbäcken uppstr Svalöv","2015-06-25",14.7,10.3,101.80420969558202,7.99,13,42.3,17,53,32,1500,36,2300,9.3000000000000007,null,2015,6]
[1,"14 Svalövsbäcken uppstr Svalöv","2015-07-28",16.7,7.6,78.314751037939814,7.91,8.6999999999999993,44,41,76,25,700,190,1600,10,null,2015,7]
[1,"14 Svalövsbäcken uppstr Svalöv","2015-08-26",18.2,7.7,81.754561649211354,8.1,12,46.2,11,70,45,81,53,1100,12,null,2015,8]
[1,"14 Svalövsbäcken uppstr Svalöv","2015-09-30",14.2,10.4,101.6942683924746,8.06,7.6,50,8.6999999999999993,34,19,3600,21,3600,"<5",null,2015,9]
[1,"14 Svalövsbäcken uppstr Svalöv","2015-10-28",8.5,10.7,91.724582439901582,8.24,8.8000000000000007,51.9,13,41,22,2100,"<10",2700,11,null,2015,10]
[1,"14 Svalövsbäcken uppstr Svalöv","2015-12-21",7.4,11.2,93.421957519081317,7.74,9,40.9,20,37,"<5",6200,27,6600,6.8,null,2015,12]
[1,"14 Svalövsbäcken uppstr Svalöv","2016-01-27",2.7,12.2,89.919374737420682,7.56,15,34.6,39,74,12,3500,53,4000,12,null,2016,1]
[1,"14 Svalövsbäcken uppstr Svalöv","2016-02-25",3,11.7,86.946799614114894,7.77,9.5,32.9,18,37,5,5600,"<10",5600,6.4,null,2016,2]
[1,"14 Svalövsbäcken uppstr Svalöv","2016-03-30",7.8,11.2,94.361963291437377,8.14,5.7,38.700000000000003,8.1,27,9,3100,"<10",3500,"<5",null,2016,3]
[1,"14 Svalövsbäcken uppstr Svalöv","2016-04-27",6.5,10.6,86.421844657703105,8.24,9.6999999999999993,39,5.6,30,17,1600,29,2600,14,null,2016,4]
[1,"14 Svalövsbäcken uppstr Svalöv","2016-05-31",20,7.8,85.71370611341041,7.94,17,47.6,22,74,36,980,120,2000,16,null,2016,5]
[1,"14 Svalövsbäcken uppstr Svalöv","2016-06-28",19.8,6.6,72.256225493882496,7.97,10,49.3,34,120,45,130,50,1100,8.3000000000000007,null,2016,6]
[1,"14 Svalövsbäcken uppstr Svalöv","2016-07-26",23.8,6.2,72.873888554067634,7.86,9.8000000000000007,44.7,33,96,40,1200,42,1900,16,null,2016,7]
[1,"14 Svalövsbäcken uppstr Svalöv","2016-08-30",17.2,8.1,84.314233722339239,7.99,17,46.4,31,88,38,120,14,770,13,null,2016,8]
[1,"14 Svalövsbäcken uppstr Svalöv","2016-09-27",13.6,8.6,83.002082468010528,8.0299999999999994,8.8000000000000007,49.5,25,73,33,120,14,890,7.2,null,2016,9]
[1,"14 Svalövsbäcken uppstr Svalöv","2016-10-26",8.1999999999999993,10.9,92.750813571392797,8.1199999999999992,5.8,49.7,17,72,19,430,51,1100,"<5",null,2016,10]
[1,"14 Svalövsbäcken uppstr Svalöv","2016-11-29",2.6,13.2,97.022315445111971,8.06,6.8,52,4.2,43,9,9100,16,9700,6.1,null,2016,11]
[1,"14 Svalövsbäcken uppstr Svalöv","2016-12-28",3.4,12.6,null,8.01,9.4,49.9,23,48,20,10000,27,10000,9.5,null,2016,12]
[1,"14 Svalövsbäcken uppstr Svalöv","2017-01-31",3,13.2,98.093825205668082,7.83,4.0999999999999996,49.6,12,26,"<5",10000,19,10000,"<5",null,2017,1]
[1,"14 Svalövsbäcken uppstr Svalöv","2017-02-28",5.2,11.6,91.440702087397483,7.49,21,40.6,31,86,56,15000,20,15000,8.1999999999999993,null,2017,2]
[1,"14 Svalövsbäcken uppstr Svalöv","2017-03-28",6.7,11.4,93.420250181319133,7.82,6.9,42.9,9.3000000000000007,26,9,7900,12,8300,"<5",null,2017,3]
[1,"14 Svalövsbäcken uppstr Svalöv","2017-04-26",7.9,12,101.35416822076581,8.1199999999999992,6.5,43.3,7.1,21,10,3900,"<10",4400,5.7,null,2017,4]
[1,"14 Svalövsbäcken uppstr Svalöv","2017-05-30",17.899999999999999,7.3,77.052326433761962,8.0500000000000007,13,48.9,6.3,81,66,1100,100,2000,20,null,2017,5]
[1,"14 Svalövsbäcken uppstr Svalöv","2017-06-27",16.2,8.1,82.617763518824688,8.0500000000000007,26,48.6,26,92,61,1300,32,2400,33,null,2017,6]
[1,"14 Svalövsbäcken uppstr Svalöv","2017-07-31",17.899999999999999,8,84.44090568083503,8.27,25,45.6,5.4,95,66,64,16,1200,23,null,2017,7]
[1,"14 Svalövsbäcken uppstr Svalöv","2017-08-29",14.8,9.5,94.097580827655733,8.06,18,44.7,7.6,46,30,2800,34,3500,16,null,2017,8]
[1,"14 Svalövsbäcken uppstr Svalöv","2017-09-25",13.9,9.1999999999999993,89.376795977067005,7.77,7,46.8,26,59,15,6000,44,6700,11,null,2017,9]
[1,"14 Svalövsbäcken uppstr Svalöv","2017-10-31",7,11,90.832227327301325,7.62,34,40.299999999999997,38,96,49,7800,29,7200,11,null,2017,10]
[1,"14 Svalövsbäcken uppstr Svalöv","2017-11-21",4.5999999999999996,11.7,90.779273279199572,7.66,16,45.5,26,58,"<5",7100,35,7200,5.0999999999999996,null,2017,11]
[1,"14 Svalövsbäcken uppstr Svalöv","2017-12-28",5,11.3,88.60846552881749,7.63,20,37.1,33,61,24,5800,34,5800,11,null,2017,12]
[1,"14 Svalövsbäcken uppstr Svalöv","2018-01-30",4.3,12.3,95,7.72,54,33.5,25,100,74,5000,"<10",5100,26,null,2018,1]
[1,"14 Svalövsbäcken uppstr Svalöv","2018-02-28",0.6,13.4,93,7.84,5.2,43.6,14,33,9,4000,61,4300,"<5",null,2018,2]
[1,"14 Svalövsbäcken uppstr Svalöv","2018-03-27",3.2,12.3,92,7.67,4.9000000000000004,36.9,15,37,16,3000,60,3800,"<5",null,2018,3]
[1,"14 Svalövsbäcken uppstr Svalöv","2018-04-25",11.2,9.5,87,7.85,10,42.1,15,49,28,2200,40,2700,8.9,null,2018,4]
[1,"14 Svalövsbäcken uppstr Svalöv","2018-05-29",18.7,7.5,80,7.82,20.5,47.9,"<2",62,37,1200,51,2100,15,null,2018,5]
[1,"14 Svalövsbäcken uppstr Svalöv","2018-06-18",18,6.4,68,7.87,16,51.7,null,null,null,null,null,null,null,"Proverna försvunna ",2018,6]
[1,"14 Svalövsbäcken uppstr Svalöv","2018-07-16",21.4,7,79,7.98,23,61.3,61,130,53,63,110,1000,29,null,2018,7]
[1,"14 Svalövsbäcken uppstr Svalöv","2018-08-28",15.3,8.3000000000000007,83,7.72,4.9000000000000004,57.2,75,140,30,320,14,1300,19,null,2018,8]
[1,"14 Svalövsbäcken uppstr Svalöv","2018-10-30",6.8,12.2,100,8.0399999999999991,11,55.8,30,93,51,380,17,1100,6.3,null,2018,10]
[1,"14 Svalövsbäcken uppstr Svalöv","2018-11-27",1,12.9,91,7.89,4.8,60.9,8.4,57,28,880,"<10",1500,5.6,null,2018,11]
[1,"14 Svalövsbäcken uppstr Svalöv","2018-12-20",3,11.2,83,7.5,5,65.900000000000006,22,48,20,19000,48,19000,7.6,null,2018,12]
[1,"14 Svalövsbäcken uppstr Svalöv","2019-01-29",2.7,12.8,94,7.59,5.8,54.5,20,35,11,13000,38,13000,"<5",null,2019,1]
[1,"14 Svalövsbäcken uppstr Svalöv","2019-02-26",5.6,13.3,106,7.76,5.6,46.3,13,27,8,13000,20,13000,"<5",null,2019,2]
[1,"14 Svalövsbäcken uppstr Svalöv","2019-03-26",7.2,11.2,93,7.87,5.7,38.9,12,31,14,7100,16,7000,"<5",null,2019,3]
[1,"14 Svalövsbäcken uppstr Svalöv","2019-04-23",12.7,11.1,105,8.3000000000000007,8.6999999999999993,44.7,2.6,42,30,3300,10,3900,7.4,null,2019,4]
[1,"14 Svalövsbäcken uppstr Svalöv","2019-05-27",15.1,7.4,74,8.24,9.5,50.6,5.9,61,43,1100,65,2000,7.4,null,2019,5]
[1,"14 Svalövsbäcken uppstr Svalöv","2019-06-24",21.6,8,91,8.35,15.7,47.4,6.8,120,99,470,33,1500,16,null,2019,6]
[1,"14 Svalövsbäcken uppstr Svalöv","2019-07-22",20.100000000000001,6.5,72,7.87,16.399999999999999,49.6,80,160,50,98,63,1300,13,null,2019,7]
[1,"14 Svalövsbäcken uppstr Svalöv","2019-08-27",23.1,6.9,80,7.83,5.2,48.4,46,130,52,76,44,1100,8.6,null,2019,8]
[1,"14 Svalövsbäcken uppstr Svalöv","2019-09-25",9.9,10.5,93,7.69,9.6,56,38,98,27,110,"<10",1000,8.9,null,2019,9]
[1,"14 Svalövsbäcken uppstr Svalöv","2019-09-26",13.4,9,86,8.06,6.8,52.2,16,73,37,4900,72,4900,6.5,null,2019,9]
[1,"14 Svalövsbäcken uppstr Svalöv","2019-10-21",11.4,9.4,86,7.52,15,49.5,26,70,33,10000,45,11000,6.6,null,2019,10]
[1,"14 Svalövsbäcken uppstr Svalöv","2019-11-25",6.6,11.8,96,7.92,7.9,50.6,20,46,24,8900,26,8600,7,null,2019,11]
[1,"14 Svalövsbäcken uppstr Svalöv","2019-12-19",5.4,11.9,94,7.52,8.3000000000000007,40.1,17,47,18,8500,30,8300,"<5",null,2019,12]
[2,"15:2 Svalövsbäcken nedstr Svalöv","2010-01-26",-0.1,15.7,106.93145418055717,7.86,9.1999999999999993,62,40,51,null,4500,980,6200,"<5","fruset",2010,1]
[2,"15:2 Svalövsbäcken nedstr Svalöv","2010-02-22",0,14.9,101.77595628415301,7.99,9.75,68.8,28,50,null,4000,700,5200,7.4,null,2010,2]
[2,"15:2 Svalövsbäcken nedstr Svalöv","2010-03-24",3.7,12.8,96.948698234368237,7.66,19,34,41,68,null,5700,60,6600,15,null,2010,3]
[2,"15:2 Svalövsbäcken nedstr Svalöv","2010-04-27",8.8000000000000007,7.8,67.357685469313836,8,2.6,49.9,9,25,null,2800,370,4000,"<5",null,2010,4]
[2,"15:2 Svalövsbäcken nedstr Svalöv","2010-05-27",13.6,13.1,126.43340468964395,8.24,3.2,53.1,3,44,null,3200,210,4400,"<5",null,2010,5]
[2,"15:2 Svalövsbäcken nedstr Svalöv","2010-06-23",16.5,8.73,89.593042448948495,8.09,5.9,55.2,11,62,null,3800,150,5100,9.1999999999999993,null,2010,6]
[2,"15:2 Svalövsbäcken nedstr Svalöv","2010-07-19",16.399999999999999,9.92,101.59758892313666,7.95,1.1000000000000001,66.900000000000006,49,68,null,7600,43,8200,"<5",null,2010,7]
[2,"15:2 Svalövsbäcken nedstr Svalöv","2010-08-25",20.100000000000001,11.6,127.70931007646409,8.16,5,45,16,68,null,3400,24,4200,5.7,null,2010,8]
[2,"15:2 Svalövsbäcken nedstr Svalöv","2010-09-28",11,10.130000000000001,92.189677162344069,8.08,2.4,56.3,29,49,null,5100,21,6000,"<5",null,{"$f":"YEAR(C135)","v":2010},{"$f":"MONTH(C135)","v":9}]
[2,"15:2 Svalövsbäcken nedstr Svalöv","2010-10-26",7.5,10.7,89.475691770396622,7.5,52,44,67,120,null,9500,13,10000,20,null,2010,10]
[2,"15:2 Svalövsbäcken nedstr Svalöv","2010-11-23",4.9000000000000004,11.4,89.15709964608827,7.5,146,40.9,92,260,null,6700,"<10",7700,61,null,2010,11]
[2,"15:2 Svalövsbäcken nedstr Svalöv","2010-12-21",0.1,14.8,101.38451967501308,7.82,7.5,53.3,29,42,null,4800,490,6000,"<5","istäckt",2010,12]
[2,"15:2 Svalövsbäcken nedstr Svalöv","2011-01-27",1.4,13.6,96.676368714017556,7.58,21,39.1,41,58,null,4900,130,5600,"<5",null,2011,1]
[2,"15:2 Svalövsbäcken nedstr Svalöv","2011-02-24",0.2,14,96.180467021504498,7.95,6.6,49.7,27,43,null,4600,600,6200,"<5",null,2011,2]
[2,"15:2 Svalövsbäcken nedstr Svalöv","2011-03-29",5,15.3,119.97429403459358,8.3800000000000008,3.2,44.7,6,28,null,3600,210,4700,"<5",null,2011,3]
[2,"15:2 Svalövsbäcken nedstr Svalöv","2011-04-27",12.7,13.1,123.93702631314794,8.19,2.7,50.4,14,33,null,3000,230,3800,"<5",null,2011,4]
[2,"15:2 Svalövsbäcken nedstr Svalöv","2011-05-24",12.7,8.4,79.471070307667375,7.8,9,54.2,44,75,null,3600,750,5300,"<5",null,2011,5]
[2,"15:2 Svalövsbäcken nedstr Svalöv","2011-06-28",16.100000000000001,10.8,109.93023763426982,7.91,4.5999999999999996,54.6,13,41,null,3700,73,4700,"<5",null,2011,6]
[2,"15:2 Svalövsbäcken nedstr Svalöv","2011-07-27",16,9.6,97.514097877778909,7.93,6.9,45.5,42,96,null,2400,18,3400,5.4,null,2011,7]
[2,"15:2 Svalövsbäcken nedstr Svalöv","2011-08-30",14.4,9.1999999999999993,90.349104214179661,7.8,12,47.7,19,84,null,4400,46,5400,9.1999999999999993,null,2011,8]
[2,"15:2 Svalövsbäcken nedstr Svalöv","2011-09-27",12.6,8.5,80.237084119723704,7.96,2.9,51.3,31,37,null,3000,61,4000,"<5",null,2011,9]
[2,"15:2 Svalövsbäcken nedstr Svalöv","2011-10-26",8.8000000000000007,10.5,90.673807362537843,7.91,4.7,51.6,30,44,null,4200,150,5000,"<5",null,2011,10]
[2,"15:2 Svalövsbäcken nedstr Svalöv","2011-11-29",5.4,11.6,91.921169654499906,7.99,9.1,49.9,35,59,null,3200,230,3900,7.2,null,2011,11]
[2,"15:2 Svalövsbäcken nedstr Svalöv","2011-12-22",4.0999999999999996,12.2,93.404216320859888,7.87,8,48.2,28,45,null,5400,97,6000,"<5",null,2011,12]
[2,"15:2 Svalövsbäcken nedstr Svalöv","2012-01-27",2,13.3,96.145670787918704,7.81,10,49.6,22,46,null,4900,190,5900,8.9,null,2012,1]
[2,"15:2 Svalövsbäcken nedstr Svalöv","2012-02-28",2.9,12.6,93.378955660141926,7.61,15,37.700000000000003,38,66,null,4000,180,5300,7,null,2012,2]
[2,"15:2 Svalövsbäcken nedstr Svalöv","2012-03-29",6.9,13.2,108.72257535739377,8.2200000000000006,2.7,47.2,8,21,15,3200,28,4100,"<5",null,2012,3]
[2,"15:2 Svalövsbäcken nedstr Svalöv","2012-04-25",8.9,9.6999999999999993,83.969841833777537,7.86,2.7,48.9,4,24,null,2500,300,3500,"<5",null,2012,4]
[2,"15:2 Svalövsbäcken nedstr Svalöv","2012-05-29",13.1,7.8,74.455385473432727,7.93,3,60.8,5,49,null,3600,230,4500,"<5",null,2012,5]
[2,"15:2 Svalövsbäcken nedstr Svalöv","2012-06-26",14.2,9.8000000000000007,95.827291369831826,7.91,7.8,49.7,25,74,null,2400,88,3300,"<5",null,2012,6]
[2,"15:2 Svalövsbäcken nedstr Svalöv","2012-07-25",16.2,9,91.797515020916336,7.88,2.1,59.8,20,46,null,6100,49,6200,"<5",null,2012,7]
[2,"15:2 Svalövsbäcken nedstr Svalöv","2012-08-27",18.5,10.4,111.06906393601122,8.11,1.6,43.5,58,100,null,7100,520,8900,"<5",null,2012,8]
[2,"15:2 Svalövsbäcken nedstr Svalöv","2012-09-24",11.9,10.199999999999999,94.771633764440097,8.01,3.5,51.7,22,62,null,3300,31,3800,"<5",null,2012,9]
[2,"15:2 Svalövsbäcken nedstr Svalöv","2012-10-30",7,10.9,90.006479806144057,7.65,136,41.7,52,280,null,4700,"<10",6200,110,null,2012,10]
[2,"15:2 Svalövsbäcken nedstr Svalöv","2012-11-25",5.5,12.7,100.90111482896506,7.41,75,34,93,240,null,7900,15,8300,47,null,2012,11]
[2,"15:2 Svalövsbäcken nedstr Svalöv","2012-11-28",6.8,12.8,105.16036089903622,7.65,24,43.8,37,56,null,6800,32,7300,11,null,2012,11]
[2,"15:2 Svalövsbäcken nedstr Svalöv","2012-12-20",3.1,13.6,101.3430003484672,7.48,14,45.3,28,59,null,7100,72,7800,8.9,null,2012,12]
[2,"15:2 Svalövsbäcken nedstr Svalöv","2013-01-30",2.7,12.8,94.341639068769254,7.6,131,29.6,180,310,null,2900,210,4000,110,null,2013,1]
[2,"15:2 Svalövsbäcken nedstr Svalöv","2013-02-26",2.2999999999999998,13.5,98.408209149014354,7.92,2.2999999999999998,47.9,7,28,null,4700,210,5300,"<5",null,2013,2]
[2,"15:2 Svalövsbäcken nedstr Svalöv","2013-03-26",0.5,14,97.011008711734831,7.96,2.5,53.5,9,21,null,4700,840,5600,"<5",null,2013,3]
[2,"15:2 Svalövsbäcken nedstr Svalöv","2013-04-25",8.5,12.2,104.58316876325226,8.01,3.6,43.9,6,27,null,2800,280,3500,"<5",null,2013,4]
[2,"15:2 Svalövsbäcken nedstr Svalöv","2013-05-29",12.2,9,84.194154862734322,7.77,3.7,64.3,35,62,null,6500,320,7500,"<5",null,2013,5]
[2,"15:2 Svalövsbäcken nedstr Svalöv","2013-06-26",14.4,8.6999999999999993,85.438826811235131,7.85,1.9,51.1,16,39,null,6200,73,6900,"<5",null,2013,6]
[2,"15:2 Svalövsbäcken nedstr Svalöv","2013-07-25",15.9,9.5,96.298674411922107,7.88,1.1000000000000001,63.6,17,35,null,8500,43,8900,"<5",null,2013,7]
[2,"15:2 Svalövsbäcken nedstr Svalöv","2013-08-27",14.4,9,88.384993253001852,7.8,1.7,60.7,66,100,null,7600,36,8300,"<5",null,2013,8]
[2,"15:2 Svalövsbäcken nedstr Svalöv","2013-09-26",9.9,10.3,91.338925749115631,7.87,0.89,60.3,22,42,null,7200,23,7900,"<5",null,2013,9]
[2,"15:2 Svalövsbäcken nedstr Svalöv","2013-10-29",10.7,9.4,84.949022368736664,7.84,14,50.4,46,80,null,7200,61,8200,6.2,null,2013,10]
[2,"15:2 Svalövsbäcken nedstr Svalöv","2013-11-27",5.2,12,94.593829745583605,7.83,5.0999999999999996,53.5,30,48,null,6700,350,8300,6,null,2013,11]
[2,"15:2 Svalövsbäcken nedstr Svalöv","2013-12-23",5.3,12.1,95.632614438755269,7.75,8.8000000000000007,43.3,20,40,null,7300,72,7500,6,null,2013,12]
[2,"15:2 Svalövsbäcken nedstr Svalöv","2014-01-28",0.6,14,97.288503863327747,7.87,11,48.9,21,39,null,5100,290,6500,7,null,2014,1]
[2,"15:2 Svalövsbäcken nedstr Svalöv","2014-02-27",4.3,12.8,98.523731951852582,7.84,6.7,43.7,19,42,null,5800,210,6400,"<5",null,2014,2]
[2,"15:2 Svalövsbäcken nedstr Svalöv","2014-03-27",4.8,14,109.20216018483661,8.06,3.5,44.7,8,21,null,2900,170,3800,"<5",null,2014,3]
[2,"15:2 Svalövsbäcken nedstr Svalöv","2014-04-29",10.1,9.5,84.646448136481311,7.81,1.8,51.2,"<2",20,null,3700,120,4600,"<5",null,2014,4]
[2,"15:2 Svalövsbäcken nedstr Svalöv","2014-05-28",12.7,9.6,90.824080351619855,7.78,2.8,51.8,19,41,null,4800,88,6300,"<5",null,2014,5]
[2,"15:2 Svalövsbäcken nedstr Svalöv","2014-06-24",12.8,9,85.338223427721587,7.8,4,55.2,17,47,null,4100,57,5400,7.4,"igenväxt",2014,6]
[2,"15:2 Svalövsbäcken nedstr Svalöv","2014-07-21",17.7,7.7,80.95375185156378,7.75,0.91,64.5,39,56,null,6700,36,7500,"<5","igenväxt",2014,7]
[2,"15:2 Svalövsbäcken nedstr Svalöv","2014-08-28",14.2,8.3000000000000007,81.159848813224926,7.85,1.8,60.2,24,58,null,6700,22,7900,"<5",null,2014,8]
[2,"15:2 Svalövsbäcken nedstr Svalöv","2014-09-30",12.6,8.5,80.237084119723704,7.79,1.2,64.599999999999994,63,85,null,9100,130,9700,"<5",null,2014,9]
[2,"15:2 Svalövsbäcken nedstr Svalöv","2014-10-29",10.4,10.199999999999999,91.530983483759925,7.86,10,52.1,39,65,null,7800,78,9000,6.1,null,2014,10]
[2,"15:2 Svalövsbäcken nedstr Svalöv","2014-11-27",6.4,11.7,95.146090176543083,7.95,5.0999999999999996,53.5,43,60,null,6200,81,6800,"<5",null,2014,11]
[2,"15:2 Svalövsbäcken nedstr Svalöv","2014-12-22",6.5,11.2,91.313647185497629,7.49,250,34.5,74,490,null,6700,12,8200,150,"grumligt",2014,12]
[2,"15:2 Svalövsbäcken nedstr Svalöv","2015-01-27",3.5,12.6,94.918787621417849,7.66,51,35.700000000000003,43,110,null,5900,31,7000,21,null,2015,1]
[2,"15:2 Svalövsbäcken nedstr Svalöv","2015-02-24",3.5,12.8,96.425435043980031,7.72,22,42.6,20,52,null,6500,24,6800,9,null,2015,2]
[2,"15:2 Svalövsbäcken nedstr Svalöv","2015-03-31",5,10.8,84.687736965595491,7.46,45,39.9,70,110,null,12000,110,12000,22,null,2015,3]
[2,"15:2 Svalövsbäcken nedstr Svalöv","2015-04-29",8.1,10.6,89.975107902268277,7.94,2.8,46.9,5.8,25,null,4400,190,4900,"<5",null,2015,4]
[2,"15:2 Svalövsbäcken nedstr Svalöv","2015-05-27",11.6,10.8,99.659898491650551,8.0399999999999991,2.8,49.6,25,56,null,1100,34,4600,"<5",null,2015,5]
[2,"15:2 Svalövsbäcken nedstr Svalöv","2015-06-25",12.7,9.11,86.188267917005916,7.83,3.6,53.8,71,110,null,4500,120,5000,"<5",null,2015,6]
[2,"15:2 Svalövsbäcken nedstr Svalöv","2015-07-28",15.7,7.4,74.700374170274671,7.76,11,38.9,74,120,null,2900,130,3200,9.4,null,2015,7]
[2,"15:2 Svalövsbäcken nedstr Svalöv","2015-08-26",15.2,8.5,84.909584510051999,7.71,1,49.7,100,150,null,4500,170,4800,7.2,null,2015,8]
[2,"15:2 Svalövsbäcken nedstr Svalöv","2015-09-30",13.1,10.5,100.22840352192868,7.89,4.7,59,26,60,null,6800,98,6500,"<5",null,2015,9]
[2,"15:2 Svalövsbäcken nedstr Svalöv","2015-10-28",8.1999999999999993,9.6999999999999993,82.539714829588078,7.86,2,60.6,36,56,null,6300,44,6300,"<5",null,2015,10]
[2,"15:2 Svalövsbäcken nedstr Svalöv","2015-12-21",7.7,11.1,93.286386221021587,7.81,9.8000000000000007,48.1,30,60,null,6800,120,7000,6.1,null,2015,12]
[2,"15:2 Svalövsbäcken nedstr Svalöv","2016-01-27",3.6,11.8,89.133286214788114,7.61,33,38.799999999999997,41,100,null,4100,180,4700,31,null,{"$f":"YEAR(C199)","v":2016},{"$f":"MONTH(C199)","v":1}]
[2,"15:2 Svalövsbäcken nedstr Svalöv","2016-02-25",3.4,11.6,87.1487538448593,7.84,8.5,40.700000000000003,24,54,null,6000,17,5900,5.9,null,2016,2]
[2,"15:2 Svalövsbäcken nedstr Svalöv","2016-03-30",6.5,11.3,92.128947606796714,7.94,2.5,45.9,22,29,null,3900,130,3700,"<5",null,2016,3]
[2,"15:2 Svalövsbäcken nedstr Svalöv","2016-04-27",5.9,10.3,82.688701464530894,7.88,5.4,43.2,33,52,null,2900,190,3700,7.1,null,2016,4]
[2,"15:2 Svalövsbäcken nedstr Svalöv","2016-05-31",16.7,7.3,75.223379286442182,7.74,2,55.8,130,150,null,3500,240,4100,"<5",null,2016,5]
[2,"15:2 Svalövsbäcken nedstr Svalöv","2016-06-28",16.399999999999999,7.3,74.764354751905003,7.68,2.7,39.799999999999997,100,160,null,3100,120,3200,"<5",null,2016,6]
[2,"15:2 Svalövsbäcken nedstr Svalöv","2016-07-26",18.3,7.7,81.914421394095513,7.77,1.8,66.3,59,94,null,7500,110,7700,"<5",null,2016,7]
[2,"15:2 Svalövsbäcken nedstr Svalöv","2016-08-30",14.9,7.1,70.475359374506397,7.63,1.4,54.2,58,77,null,7200,200,6800,"<5",null,2016,8]
[2,"15:2 Svalövsbäcken nedstr Svalöv","2016-09-27",12.2,8.6999999999999993,81.387683033976501,7.83,2.5,70.55,30,58,null,11000,54,12000,"<5",null,2016,9]
[2,"15:2 Svalövsbäcken nedstr Svalöv","2016-10-26",8.1,9.4,79.789246630313386,7.78,1.3,65.7,170,230,null,6900,210,7400,"<5",null,2016,10]
[2,"15:2 Svalövsbäcken nedstr Svalöv","2016-11-29",2.8,12.1,89.427771107201053,7.85,3.6,59.5,19,99,null,8600,240,9300,"<5",null,2016,11]
[2,"15:2 Svalövsbäcken nedstr Svalöv","2016-12-28",3.1,12.7,null,7.95,11,54.4,27,69,null,10000,140,10000,9.6,null,2016,12]
[2,"15:2 Svalövsbäcken nedstr Svalöv","2017-01-31",3.2,12.4,92.653425760077297,7.86,3.1,55.8,19,40,null,9800,480,10000,"<5",null,2017,1]
[2,"15:2 Svalövsbäcken nedstr Svalöv","2017-02-28",4.9000000000000004,11.7,91.503339110459009,7.68,24,45.3,38,77,null,14000,88,14000,12,null,2017,2]
[2,"15:2 Svalövsbäcken nedstr Svalöv","2017-03-28",6.4,11.5,93.519661284636371,7.89,4.7,49.2,3.8,25,null,8300,200,8600,"<5",null,2017,3]
[2,"15:2 Svalövsbäcken nedstr Svalöv","2017-04-26",6.4,12.8,104.09144908203005,8.0399999999999991,2.2999999999999998,49.9,6.2,23,null,4400,180,5100,"<5",null,2017,4]
[2,"15:2 Svalövsbäcken nedstr Svalöv","2017-05-30",14.6,7.2,71.012111095779161,7.69,2.4,63.3,140,170,null,6300,440,6500,"<5",null,2017,5]
[2,"15:2 Svalövsbäcken nedstr Svalöv","2017-06-27",13.7,8.1999999999999993,79.31502117354286,7.82,1.9,61.3,100,130,null,5200,110,5500,"<5",null,2017,6]
[2,"15:2 Svalövsbäcken nedstr Svalöv","2017-07-31",16.399999999999999,6.8,69.643508536021102,7.69,3.7,52,42,88,null,3200,640,4200,"<5",null,2017,7]
[2,"15:2 Svalövsbäcken nedstr Svalöv","2017-08-29",16.100000000000001,7.4,75.322570230888573,7.76,9.1,55.2,8.1,58,null,3400,190,4200,6,null,2017,8]
[2,"15:2 Svalövsbäcken nedstr Svalöv","2017-09-25",13.7,9.3000000000000007,89.95484108706691,7.82,5.9,53.7,39,75,null,6300,140,6900,9.6999999999999993,null,2017,9]
[2,"15:2 Svalövsbäcken nedstr Svalöv","2017-10-31",7.3,11.1,92.35519803415157,7.75,31,46.3,48,99,null,7900,48,7200,13,null,2017,10]
[2,"15:2 Svalövsbäcken nedstr Svalöv","2017-11-21",4.7,11.9,92.576354367371167,7.81,15,50.9,32,60,null,7000,160,7000,"<5",null,2017,11]
[2,"15:2 Svalövsbäcken nedstr Svalöv","2017-12-28",5.4,11.1,87.959050272840429,7.73,21,43.9,39,72,null,5900,310,6300,10,null,2017,12]
[2,"15:2 Svalövsbäcken nedstr Svalöv","2018-01-30",4.5,12.3,95,7.81,51,38.799999999999997,30,130,null,5100,120,5200,20,null,2018,1]
[2,"15:2 Svalövsbäcken nedstr Svalöv","2018-02-28",0,14,96,7.89,5.8,54.1,23,46,null,4800,640,5100,"<5","is",2018,2]
[2,"15:2 Svalövsbäcken nedstr Svalöv","2018-03-27",3,12.3,91,7.84,7.1,44.6,20,44,null,3800,270,4400,6.5,null,2018,3]
[2,"15:2 Svalövsbäcken nedstr Svalöv","2018-04-25",9.5,9.6,84,7.78,3.3,52.5,3.2,29,null,3500,360,3800,"<5",null,2018,4]
[2,"15:2 Svalövsbäcken nedstr Svalöv","2018-05-29",16.100000000000001,8.3000000000000007,84,7.74,8,62.6,45,86,null,3800,200,4200,7,null,2018,5]
[2,"15:2 Svalövsbäcken nedstr Svalöv","2018-06-18",15,7.4,74,7.66,2.6,55.9,null,null,null,null,null,null,null,"Proverna försvunna ",2018,6]
[2,"15:2 Svalövsbäcken nedstr Svalöv","2018-07-16",19.100000000000001,2.1,23,7.68,6.6,88.1,120,250,null,"<10",10000,13000,7.5,null,2018,7]
[2,"15:2 Svalövsbäcken nedstr Svalöv","2018-08-28",15.2,4.4000000000000004,44,7.41,1.9,38.5,81,110,null,4000,330,4600,"<5",null,2018,8]
[2,"15:2 Svalövsbäcken nedstr Svalöv","2018-10-30",8.3000000000000007,10.4,89,7.88,2.1,67.599999999999994,51,76,null,7000,200,7100,"<5",null,2018,10]
[2,"15:2 Svalövsbäcken nedstr Svalöv","2018-11-27",0.8,9.5,66,7.6,3.7,72.3,160,210,null,7900,3700,10000,"<5",null,2018,11]
[2,"15:2 Svalövsbäcken nedstr Svalöv","2018-12-20",4.5,10.9,84,7.59,5.5,66.5,25,48,null,15000,680,14000,"<5",null,2018,12]
[2,"15:2 Svalövsbäcken nedstr Svalöv","2019-01-29",2.6,12.5,92,7.68,8.6999999999999993,58,28,53,null,14000,170,14000,7.5,null,2019,1]
[2,"15:2 Svalövsbäcken nedstr Svalöv","2019-02-26",6.4,13,106,7.89,4.5,52.9,20,33,null,13000,250,14000,"<5",null,2019,2]
[2,"15:2 Svalövsbäcken nedstr Svalöv","2019-03-26",8.1,11.4,97,7.95,4.4000000000000004,46.6,18,36,null,7400,560,8000,"<5",null,2019,3]
[2,"15:2 Svalövsbäcken nedstr Svalöv","2019-04-23",12.2,11,103,8.44,1.4,52.6,"<2",29,null,5300,130,5400,"<5",null,2019,4]
[2,"15:2 Svalövsbäcken nedstr Svalöv","2019-05-27",13.5,7.3,70,7.82,1.2,58.4,83,120,null,6300,870,7300,"<5",null,2019,5]
[2,"15:2 Svalövsbäcken nedstr Svalöv","2019-06-24",17.399999999999999,12.8,134,8.3800000000000008,1.25,62.25,74,100,null,7800,21,8500,"<5",null,2019,6]
[2,"15:2 Svalövsbäcken nedstr Svalöv","2019-07-22",17.100000000000001,9.6999999999999993,101,7.86,1.3,54.9,210,340,null,4700,87,5200,9.8000000000000007,null,2019,7]
[2,"15:2 Svalövsbäcken nedstr Svalöv","2019-08-27",21.1,3.8,43,7.65,6.8,81.400000000000006,260,620,null,350,12000,15000,11,null,2019,8]
[2,"15:2 Svalövsbäcken nedstr Svalöv","2019-09-25",9.8000000000000007,8.4,74,7.52,5.0999999999999996,38.5,98,130,null,3200,110,4100,"<5",null,2019,9]
[2,"15:2 Svalövsbäcken nedstr Svalöv","2019-09-26",13.3,5.8,56,7.65,1,68.7,150,190,null,9200,250,9200,"<5",null,2019,9]
[2,"15:2 Svalövsbäcken nedstr Svalöv","2019-10-21",11.6,10,92,7.74,13,52.5,36,83,null,11000,95,11000,6.8,null,2019,10]
[2,"15:2 Svalövsbäcken nedstr Svalöv","2019-11-25",7.3,11.5,96,7.93,7.2,54.6,29,59,31,8400,150,9400,7.2,null,2019,11]
[2,"15:2 Svalövsbäcken nedstr Svalöv","2019-12-19",6,11.9,96,7.66,10.3,47,14,65,null,9100,90,10000,11,null,2019,12]
[3,"3:2 Örstorpsbäcken","2010-01-26",-0.1,14.6,99.439441467269702,7.82,10,79.599999999999994,160,170,40,5900,110,6600,"<5","fruset",2010,1]
[3,"3:2 Örstorpsbäcken","2010-02-22",0.1,14.1,96.589305906600273,7.92,3.9,78.900000000000006,160,150,30,5100,110,5600,"<5",null,2010,2]
[3,"3:2 Örstorpsbäcken","2010-03-24",4.7,12.6,98.02202227133418,7.89,5.4,61.4,54,70,25,8600,"<10",9200,"<5",null,2010,3]
[3,"3:2 Örstorpsbäcken","2010-04-27",8.9,8,69.253477801053648,8.1,2.5,68.650000000000006,67,76,21,4700,"<10",5300,"<5",null,2010,4]
[3,"3:2 Örstorpsbäcken","2010-05-27",12.5,12.3,115.84719085000049,8.18,3.4,66.8,69,120,43,4700,33,5800,"<5",null,2010,5]
[3,"3:2 Örstorpsbäcken","2010-06-23",14.5,10,98.416767861369109,8.1,3,71.400000000000006,110,120,"<5",6500,41,7400,"<5",null,2010,6]
[3,"3:2 Örstorpsbäcken","2010-07-19",16.8,8.5299999999999994,88.076619841076337,7.88,3.8,71.5,250,270,30,4600,54,4100,"<5",null,2010,7]
[3,"3:2 Örstorpsbäcken","2010-08-25",19.399999999999999,10.1,109.74325485869399,7.93,3.1,65.5,190,220,30,5900,57,6600,"<5",null,2010,8]
[3,"3:2 Örstorpsbäcken","2010-09-28",11,9.98,90.82457829024618,8.14,3.4,74.7,170,180,30,5200,28,5800,"<5",null,2010,9]
[3,"3:2 Örstorpsbäcken","2010-10-26",8.3000000000000007,10.5,89.56802779599991,7.7,73.5,60.2,130,200,100,11000,"<10",11000,17,null,2010,10]
[3,"3:2 Örstorpsbäcken","2010-11-23",5.5,11.1,88.189163354449789,7.6,241,46.7,110,390,270,7100,"<10",8600,94,null,2010,11]
[3,"3:2 Örstorpsbäcken","2010-12-21",0.3,12.6,86.811289189328292,7.93,7.9,74.2,96,120,36,7400,66,8000,"<5","delvis is",2010,12]
[3,"3:2 Örstorpsbäcken","2011-01-27",1.4,12.9,91.700379147854889,7.69,16,61,110,120,32,6800,38,7500,6.6,null,2011,1]
[3,"3:2 Örstorpsbäcken","2011-02-24",0.8,13.5,94.350007422709822,7.99,4.2,73,130,150,20,6200,100,7200,"<5",null,2011,2]
[3,"3:2 Örstorpsbäcken","2011-03-29",5.3,17.100000000000001,135.15022371096822,8.4,2,68.400000000000006,73,87,35,6200,"<10",7300,"<5",null,2011,3]
[3,"3:2 Örstorpsbäcken","2011-04-27",12.9,14,133.0448854244724,8.1999999999999993,2.75,68.900000000000006,92,100,23,4900,13,5600,"<5",null,2011,4]
[3,"3:2 Örstorpsbäcken","2011-05-24",13.2,9,86.100629971622539,7.86,7,69.8,160,200,50,4000,97,4900,6.4,null,{"$f":"YEAR(C263)","v":2011},{"$f":"MONTH(C263)","v":5}]
[3,"3:2 Örstorpsbäcken","2011-06-28",15.1,9.5,94.698701395993538,7.92,3.5,72.5,170,180,30,6400,66,6800,"<5",null,2011,6]
[3,"3:2 Örstorpsbäcken","2011-07-27",14.3,8.6999999999999993,85.255019110911661,7.86,5.0999999999999996,76.2,150,180,40,9000,51,9800,"<5",null,2011,7]
[3,"3:2 Örstorpsbäcken","2011-08-30",14.2,9.1999999999999993,89.960314347189055,7.95,6.8,71.099999999999994,89,110,23,6200,23,6900,6.5,null,2011,8]
[3,"3:2 Örstorpsbäcken","2011-09-27",13.3,9.4,90.12633862139775,8.02,3.7,74.2,140,140,20,5200,34,6500,9.6999999999999993,null,2011,9]
[3,"3:2 Örstorpsbäcken","2011-10-26",8,10.199999999999999,86.365387981761785,7.94,2.5,74.400000000000006,110,110,14,6300,37,6300,"<5",null,2011,10]
[3,"3:2 Örstorpsbäcken","2011-11-29",5.7,11,87.851199494494722,7.96,2.6,75.8,160,180,30,4800,38,5600,"<5",null,2011,11]
[3,"3:2 Örstorpsbäcken","2011-12-22",4.8,11.6,90.481789867436049,8.01,4.3,73.3,63,79,18,7400,40,8600,"<5",null,2011,12]
[3,"3:2 Örstorpsbäcken","2012-01-27",3.4,12.9,96.915424534369393,7.88,4.2,71.900000000000006,71,85,20,8100,43,8300,"<5",null,2012,1]
[3,"3:2 Örstorpsbäcken","2012-02-28",3.9,12.5,95.18832861656567,7.76,6.7,65.3,64,95,24,6000,34,6900,7.4,null,2012,2]
[3,"3:2 Örstorpsbäcken","2012-03-29",7.7,12.1,101.69056515985237,8.1199999999999992,3,71.400000000000006,73,99,27,5600,59,6400,"<5",null,2012,3]
[3,"3:2 Örstorpsbäcken","2012-04-25",8.9,10.1,87.432515723830221,7.88,8.8000000000000007,62.6,82,110,30,4200,160,4900,10,null,2012,4]
[3,"3:2 Örstorpsbäcken","2012-05-29",12.2,8.5,79.51670181480462,7.94,5.8,70,120,200,70,3700,"<10",4300,6.2,null,2012,5]
[3,"3:2 Örstorpsbäcken","2012-06-26",13.4,9,86.481694102610092,7.79,7.1,62.8,130,180,40,8600,79,9600,"<5",null,2012,6]
[3,"3:2 Örstorpsbäcken","2012-07-25",16.600000000000001,9.5,97.694413368243488,7.99,1.4,73.3,230,280,10,3500,23,3500,"<5",null,2012,7]
[3,"3:2 Örstorpsbäcken","2012-08-27",16.7,8.4,86.558409041933487,7.83,3.4,57.9,230,300,30,2100,69,2900,"<5",null,2012,8]
[3,"3:2 Örstorpsbäcken","2012-09-24",10.8,9.4,85.148056979838728,7.81,3.9,69,240,290,30,4200,71,4600,"<5",null,2012,9]
[3,"3:2 Örstorpsbäcken","2012-10-30",7,9.9,81.749004594571204,7.74,6.6,69.2,130,170,30,5100,"<10",5800,"<5",null,2012,10]
[3,"3:2 Örstorpsbäcken","2012-11-25",6,12.4,99.805456614178794,7.68,112,46.9,88,220,120,10000,"<10",10000,30,null,2012,11]
[3,"3:2 Örstorpsbäcken","2012-11-28",7,12.6,104.04418766581789,7.79,16,66.8,53,79,24,12000,17,13000,6.2,null,2012,11]
[3,"3:2 Örstorpsbäcken","2012-12-20",3.7,14.4,109.06728551366425,7.68,12,66.099999999999994,47,69,16,12000,14,13000,5.6,null,2012,12]
[3,"3:2 Örstorpsbäcken","2013-01-30",2.4,12,87.71644130173172,7.62,187,36.6,120,320,300,4800,"<10",6600,150,null,2013,1]
[3,"3:2 Örstorpsbäcken","2013-02-26",2.7,13,95.815727179218769,7.96,2.2000000000000002,70.2,73,94,16,8400,29,8700,"<5",null,2013,2]
[3,"3:2 Örstorpsbäcken","2013-03-26",1.7,15,107.53024096811133,8.1199999999999992,1.8,70.400000000000006,52,71,17,6300,"<10",6600,"<5",null,2013,3]
[3,"3:2 Örstorpsbäcken","2013-04-25",8.4,12.4,106.03656321418376,8.0299999999999994,1.9,69.400000000000006,87,110,13,5000,39,5400,70,null,2013,4]
[3,"3:2 Örstorpsbäcken","2013-05-29",12.9,10,95.032061017480288,7.91,1.7,70.400000000000006,95,110,16,7400,56,8400,"<5",null,2013,5]
[3,"3:2 Örstorpsbäcken","2013-06-26",13.9,9,87.433822151478594,7.79,1.3,72.7,220,230,10,3800,82,4300,"<5",null,2013,6]
[3,"3:2 Örstorpsbäcken","2013-07-25",14.7,7.6,75.117669289944018,7.92,1.5,74.900000000000006,320,340,30,3100,31,3700,"<5",null,2013,7]
[3,"3:2 Örstorpsbäcken","2013-08-27",15,8.8000000000000007,87.535350987449348,7.92,2.2999999999999998,75.5,220,270,30,4000,37,4500,"<5",null,2013,8]
[3,"3:2 Örstorpsbäcken","2013-09-26",9.6999999999999993,10.4,91.786025373160996,7.98,1.8,73.400000000000006,150,180,20,4700,74,5400,"<5",null,2013,9]
[3,"3:2 Örstorpsbäcken","2013-10-29",10.199999999999999,8.8000000000000007,78.59549672770143,7.91,69,62.5,100,170,77,13000,"<10",13000,29,null,2013,10]
[3,"3:2 Örstorpsbäcken","2013-11-27",5.9,11.7,93.927942440292369,7.94,4.0999999999999996,74,87,100,8,9500,54,11000,"<5",null,2013,11]
[3,"3:2 Örstorpsbäcken","2013-12-23",5.7,11.9,95.039024907680655,7.93,8.1999999999999993,67.2,43,65,10,12000,26,12000,6,null,2013,12]
[3,"3:2 Örstorpsbäcken","2014-01-28",0.8,13.7,95.747785310453665,7.96,18,71.7,83,140,48,9000,70,10000,16,null,2014,1]
[3,"3:2 Örstorpsbäcken","2014-02-27",4.9000000000000004,12.6,98.542057503571229,7.98,4.5,67.8,77,100,72,9100,37,8900,"<5",null,2014,2]
[3,"3:2 Örstorpsbäcken","2014-03-27",4.5999999999999996,14.5,112.50422756823879,8.1,2.6,70.3,97,120,24,5900,"<10",7100,"<5",null,2014,3]
[3,"3:2 Örstorpsbäcken","2014-04-29",11.8,11.9,110.31474688380092,8,1.6,69.5,73,120,20,5400,24,6100,"<5",null,2014,4]
[3,"3:2 Örstorpsbäcken","2014-05-28",12,10.7,99.64403485693029,7.84,2.7,71.900000000000006,110,140,20,6800,35,8500,"<5",null,2014,5]
[3,"3:2 Örstorpsbäcken","2014-06-24",13.5,9.5,91.487305841621875,7.83,6,71.599999999999994,170,240,20,3800,28,4700,6.1,null,2014,6]
[3,"3:2 Örstorpsbäcken","2014-07-21",18.100000000000001,8.1999999999999993,86.892949669241617,7.78,2,72.8,240,270,10,3800,48,4600,"<5",null,2014,7]
[3,"3:2 Örstorpsbäcken","2014-08-28",15.4,11.1,111.34963344312708,8,0.83,72.099999999999994,210,280,40,3000,27,4000,13,null,2014,8]
[3,"3:2 Örstorpsbäcken","2014-09-30",12.1,10,93.337165128454131,8.02,1.5,74.400000000000006,200,210,10,3500,16,4000,"<5",null,2014,9]
[3,"3:2 Örstorpsbäcken","2014-10-29",11.1,9.6999999999999993,88.481848263774907,7.9,4.3,69.8,53,110,14,8700,15,10000,"<5",null,2014,10]
[3,"3:2 Örstorpsbäcken","2014-11-27",6.9,11.3,93.07311375292042,8.0299999999999994,4.4000000000000004,71.400000000000006,61,95,10,8400,23,9100,"<5",null,2014,11]
[3,"3:2 Örstorpsbäcken","2014-12-22",7.3,10.9,90.691140411914603,7.58,332,37.4,130,380,240,6800,"<10",8000,120,"grumligt, översvämn",2014,12]
[3,"3:2 Örstorpsbäcken","2015-01-27",4,12.1,92.390353694520329,7.73,105,48.7,59,160,87,7800,"<10",9000,21,null,2015,1]
[3,"3:2 Örstorpsbäcken","2015-02-24",4,12.7,96.971693547141172,7.9,34,60.1,64,90,33,7800,19,8100,17,null,2015,2]
[3,"3:2 Örstorpsbäcken","2015-03-31",4.7,10.6,82.46297111715414,7.66,28,60.8,76,110,36,18000,230,18000,17,null,2015,3]
[3,"3:2 Örstorpsbäcken","2015-04-29",8.9,13,112.53690142671218,8.07,2.4,68.599999999999994,80,100,11,5800,14,6000,"<5",null,2015,4]
[3,"3:2 Örstorpsbäcken","2015-05-27",11.3,12,109.97048683406057,8.16,1.9,70.3,87,120,20,1700,"<10",5900,"<5",null,2015,5]
[3,"3:2 Örstorpsbäcken","2015-06-25",12.7,10,94.608417032937353,7.99,2.2000000000000002,72.5,150,180,20,4000,59,4500,"<5",null,2015,6]
[3,"3:2 Örstorpsbäcken","2015-07-28",15.6,7.9,79.581472644490489,7.82,5.95,63.1,110,230,20,3100,30,3400,5.5,null,2015,7]
[3,"3:2 Örstorpsbäcken","2015-08-26",15.6,8.6,86.632995537040287,7.87,2.7,64.599999999999994,190,260,30,3200,39,3600,"<5",null,2015,8]
[3,"3:2 Örstorpsbäcken","2015-09-30",11.4,10.199999999999999,93.691009886800686,7.98,3.3,73.599999999999994,96,170,20,4700,33,4500,"<5",null,2015,9]
[3,"3:2 Örstorpsbäcken","2015-10-28",8.1999999999999993,9.8000000000000007,83.390639724738477,7.93,2.5,75.2,170,210,10,3800,12,3800,"<5",null,2015,10]
[3,"3:2 Örstorpsbäcken","2015-12-21",7.8,10.9,91.834410703273889,7.96,8.8000000000000007,67.8,35,90,14,9400,25,9400,5,null,2015,12]
[3,"3:2 Örstorpsbäcken","2016-01-27",4.2,11.8,90.584077633806572,7.75,37,50.8,41,170,50,7000,"<10",7700,34,null,2016,1]
[3,"3:2 Örstorpsbäcken","2016-02-25",3.5,11.5,86.632226797325814,7.99,2.2999999999999998,65.5,44,77,8,8200,"<10",8200,"<5",null,2016,2]
[3,"3:2 Örstorpsbäcken","2016-03-30",6.5,13.5,110.0655568753766,8.1,2.8,68.400000000000006,47,93,17,5800,"<10",5900,"<5",null,2016,3]
[3,"3:2 Örstorpsbäcken","2016-04-27",5.9,11.2,89.913927806091849,7.98,7.1,65.099999999999994,43,100,30,12000,96,13000,6.8,null,2016,4]
[3,"3:2 Örstorpsbäcken","2016-05-31",17.7,8.8000000000000007,92.51857354464434,7.89,3.5,68,150,200,40,3300,110,3900,6.4,null,2016,5]
[3,"3:2 Örstorpsbäcken","2016-06-28",16.8,8.6,88.799405701436868,7.97,6.3,68,260,410,30,3000,67,3000,7.7,null,2016,6]
[3,"3:2 Örstorpsbäcken","2016-07-26",18,7.5,79.319352513529822,7.88,1.5,70.400000000000006,190,230,10,4400,27,4500,"<5",null,2016,7]
[3,"3:2 Örstorpsbäcken","2016-08-30",15.7,8.3000000000000007,83.785554812605383,7.82,3.2,66.7,310,320,30,3200,19,3300,"<5",null,2016,8]
[3,"3:2 Örstorpsbäcken","2016-09-27",13.4,9.9,95.129863512871111,8.02,2.9,69.2,170,230,30,3000,19,3400,"<5",null,{"$f":"YEAR(C327)","v":2016},{"$f":"MONTH(C327)","v":9}]
[3,"3:2 Örstorpsbäcken","2016-10-26",6.5,10.4,84.791243815104949,7.9,2.5,71.599999999999994,180,210,20,3300,28,3700,"<5",null,2016,10]
[3,"3:2 Örstorpsbäcken","2016-11-29",2.7,13.2,97.289815289668283,7.95,2,76.599999999999994,73,150,10,6000,47,6600,"<5",null,2016,11]
[3,"3:2 Örstorpsbäcken","2016-12-28",3.2,12.7,null,8.09,3.7,72.900000000000006,65,95,"<5",14000,37,14000,"<5",null,2016,12]
[3,"3:2 Örstorpsbäcken","2017-01-31",3.3,12.6,94.40459274065303,7.99,2.1,72.400000000000006,71,96,8,12000,43,12000,"<5",null,2017,1]
[3,"3:2 Örstorpsbäcken","2017-02-28",5,11.7,91.745048379395087,7.85,18,65.599999999999994,32,100,53,19000,14,18000,16,null,2017,2]
[3,"3:2 Örstorpsbäcken","2017-03-28",5.9,12.2,97.941957074492905,8,2,71,41,61,9,14000,18,14000,"<5",null,2017,3]
[3,"3:2 Örstorpsbäcken","2017-04-26",7.6,14.6,122.39460074377881,8.19,2.8,69.7,71,98,17,8400,13,8800,"<5",null,2017,4]
[3,"3:2 Örstorpsbäcken","2017-05-30",14.8,8.9,88.154575722751161,7.89,4.0999999999999996,71.2,170,240,80,5300,140,5500,"<5",null,2017,5]
[3,"3:2 Örstorpsbäcken","2017-06-27",13.7,8.5,82.21679024086761,8.01,4.5,73.400000000000006,190,220,30,5500,47,5800,6.3,null,2017,6]
[3,"3:2 Örstorpsbäcken","2017-07-31",15.9,8.1,82.107290814375688,7.85,6,69.3,210,280,50,3800,70,4200,13,null,2017,7]
[3,"3:2 Örstorpsbäcken","2017-08-29",15.1,9.4,93.701872960246234,7.93,5.4,73.3,190,230,30,4800,66,5200,7.9,null,2017,8]
[3,"3:2 Örstorpsbäcken","2017-09-25",14.1,9.1999999999999993,89.765850697454766,7.97,4.3,75.099999999999994,110,140,20,8000,27,9000,5.7,null,2017,9]
[3,"3:2 Örstorpsbäcken","2017-10-31",8.1999999999999993,10.7,91.048963781092013,7.86,2.9,77.3,65,83,11,13000,31,11000,6.5,null,2017,10]
[3,"3:2 Örstorpsbäcken","2017-11-21",5.0999999999999996,11.6,91.200717701547092,7.96,11,73.7,50,68,17,12000,26,11000,"<5",null,2017,11]
[3,"3:2 Örstorpsbäcken","2017-12-28",5.9,10.6,85.097110245051212,7.84,22,68.3,59,110,41,11000,42,11000,15,null,2017,12]
[3,"3:2 Örstorpsbäcken","2018-01-30",4.5,12.3,95,7.97,29,65.8,47,91,37,9700,23,9300,14,null,2018,1]
[3,"3:2 Örstorpsbäcken","2018-02-28",0,13.5,92,7.89,11,76.8,83,120,27,8400,81,8600,9.6999999999999993,null,2018,2]
[3,"3:2 Örstorpsbäcken","2018-03-27",3.3,12.1,91,7.93,5.2,67.8,70,84,18,7600,37,7700,"<5",null,2018,3]
[3,"3:2 Örstorpsbäcken","2018-04-25",9,9.9,86,7.88,9.4,60.1,52,95,24,5200,120,4800,8.5,null,2018,4]
[3,"3:2 Örstorpsbäcken","2018-05-29",17.399999999999999,8.8000000000000007,92,7.82,5.4,74.2,180,200,30,4100,140,4400,"<5",null,2018,5]
[3,"3:2 Örstorpsbäcken","2018-06-18",15.4,8.8000000000000007,88,7.85,2,74.5,null,null,null,null,null,null,null,"Proverna försvunna ",2018,6]
[3,"3:2 Örstorpsbäcken","2018-07-16",18.100000000000001,8.5,90,7.9,5,73,220,370,220,3300,57,3900,8.5,null,2018,7]
[3,"3:2 Örstorpsbäcken","2018-08-28",14.8,8.6,85,7.79,5.0999999999999996,54.9,180,200,10,2000,35,2600,"<5",null,2018,8]
[3,"3:2 Örstorpsbäcken","2018-10-30",7.5,10.9,91,7.92,1.9,78.3,140,200,20,3500,13,3800,"<5",null,2018,10]
[3,"3:2 Örstorpsbäcken","2018-11-27",0.5,12.5,87,7.8,4.4000000000000004,79.099999999999994,200,230,30,4000,33,4100,"<5",null,2018,11]
[3,"3:2 Örstorpsbäcken","2018-12-20",4.5,12.5,97,7.77,2.1,79.900000000000006,160,160,"<5",7500,38,6600,"<5",null,2018,12]
[3,"3:2 Örstorpsbäcken","2019-01-29",3,12.6,94,7.82,20,72.400000000000006,67,110,37,25000,"<10",26000,"<5",null,2019,1]
[3,"3:2 Örstorpsbäcken","2019-02-26",5.5,12.4,99,7.95,3.5,79,51,66,13,25000,16,29000,"<5","BOD ändrat 15/4",2019,2]
[3,"3:2 Örstorpsbäcken","2019-03-26",5.4,11.7,93,7.92,7.4,72.8,83,110,25,17000,18,17000,10,null,2019,3]
[3,"3:2 Örstorpsbäcken","2019-04-23",10,11.4,101,8.06,2.4,71.599999999999994,130,140,20,8900,21,8400,"<5",null,2019,4]
[3,"3:2 Örstorpsbäcken","2019-05-27",12.4,9,85,8.09,2.7,68.400000000000006,150,190,40,5400,62,6000,"<5",null,2019,5]
[3,"3:2 Örstorpsbäcken","2019-06-24",15.5,8.5,85,7.99,4.3,69.099999999999994,190,210,10,5900,40,6500,"<5",null,2019,6]
[3,"3:2 Örstorpsbäcken","2019-07-22",16.600000000000001,7.5,77,7.86,7.3,61.3,280,320,40,3200,42,3600,7.8,null,2019,7]
[3,"3:2 Örstorpsbäcken","2019-08-27",17.600000000000001,8.1999999999999993,86,7.82,6.5,66.3,200,270,60,3500,27,3800,10,null,2019,8]
[3,"3:2 Örstorpsbäcken","2019-09-25",10.3,11.4,102,7.76,3.7,69.099999999999994,150,180,30,2500,11,3600,"<5",null,2019,9]
[3,"3:2 Örstorpsbäcken","2019-09-26",13.1,9.1999999999999993,88,8,6.2,74.599999999999994,220,270,30,4500,20,4700,"<5",null,2019,9]
[3,"3:2 Örstorpsbäcken","2019-10-21",11.2,8.9,81,7.7,19,73.2,120,170,50,18000,22,20000,6.6,null,2019,10]
[3,"3:2 Örstorpsbäcken","2019-11-25",7.4,10.8,90,7.93,5.6,78.8,87,110,25,18000,26,19000,"<5",null,2019,11]
[3,"3:2 Örstorpsbäcken","2019-12-19",5.7,11.6,93,7.77,11.3,73.3,48,94,29,18000,32,20000,9,null,2019,12]
[4,"5 Braån vid Asmundtorp","2010-01-26",-0.1,15.6,106.25036211571283,7.92,5.5,66.900000000000006,69,76,31,4800,390,5300,"<5",null,2010,1]
[4,"5 Braån vid Asmundtorp","2010-02-22",0,13.7,93.579234972677583,7.9249999999999998,6.9,73.400000000000006,65,72,29,4000,530,5000,"<5",null,2010,2]
[4,"5 Braån vid Asmundtorp","2010-03-24",3.6,13,98.197688202732664,7.85,22,38.200000000000003,51,87,48,5800,45,6900,17,null,2010,3]
[4,"5 Braån vid Asmundtorp","2010-04-27",10.1,7.3,65.044112778559324,8.1,2,54.7,9,18,8,3200,"<10",3800,"<5",null,2010,4]
[4,"5 Braån vid Asmundtorp","2010-05-27",13,10,95.24385313167592,8.1300000000000008,2.4,56.2,34,48,9,2900,38,3800,"<5",null,2010,5]
[4,"5 Braån vid Asmundtorp","2010-06-23",15.8,9.4,95.087373592416185,8.16,8,58.8,32,96,27,3300,12,4000,6.9,null,2010,6]
[4,"5 Braån vid Asmundtorp","2010-07-19",18,8.1199999999999992,85.876418987981623,8,3.3,65.099999999999994,150,160,20,2400,37,2600,"<5",null,2010,7]
[4,"5 Braån vid Asmundtorp","2010-08-25",20.100000000000001,11.6,127.70931007646409,8.06,6.2,45.1,90,130,36,2400,14,2800,"<5",null,2010,8]
[4,"5 Braån vid Asmundtorp","2010-09-28",11.6,10.14,93.569571361605242,8.14,3.3,57.5,60,73,29,5400,35,5700,"<5",null,2010,9]
[4,"5 Braån vid Asmundtorp","2010-10-26",8.1,10.8,91.672751447594109,7.8,97,45.5,120,220,120,9600,"<10",10000,33,null,2010,10]
[4,"5 Braån vid Asmundtorp","2010-11-23",5.2,11.7,92.228984001944013,7.71,208,42.6,98,350,240,6800,"<10",8300,120,null,2010,11]
[4,"5 Braån vid Asmundtorp","2010-12-21",0.2,13.2,90.684440334561373,7.9,5.8,59.9,45,55,27,5600,190,6500,"<5","delvis is",2010,12]
[4,"5 Braån vid Asmundtorp","2011-01-27",1.4,13.5,95.965513061708606,7.835,35,40.700000000000003,61,84,41,4900,65,5800,"<5",null,2011,1]
[4,"5 Braån vid Asmundtorp","2011-02-24",0.2,13.9,95.493463685636613,7.96,5.25,57,54,69,16,5000,230,6300,"<5",null,2011,2]
[4,"5 Braån vid Asmundtorp","2011-03-29",5.7,13.8,110.2133230021843,8.36,1.8,51.3,11,25,16,4600,"<10",5100,"<5",null,2011,3]
[4,"5 Braån vid Asmundtorp","2011-04-27",14.1,10.8,105.3773029926643,8.15,2.2000000000000002,55.1,17,31,19,3400,29,3900,"<5",null,2011,4]
[4,"5 Braån vid Asmundtorp","2011-05-24",13.9,7.9,76.747466110742323,7.87,4.3,58.25,98,120,20,3400,320,4600,"<5",null,2011,5]
[4,"5 Braån vid Asmundtorp","2011-06-28",15.5,9.9,99.520296258521185,8.02,4.0999999999999996,58.6,59,90,32,3000,26,3600,67,null,2011,6]
[4,"5 Braån vid Asmundtorp","2011-07-27",15.4,9.1,91.286636426347414,8.0500000000000007,6.3,49,66,98,27,2700,21,3700,"<5",null,2011,7]
[4,"5 Braån vid Asmundtorp","2011-08-30",14.6,9,88.765138869723941,8.02,9.3000000000000007,53,47,78,29,4400,24,5300,7.4,null,2011,8]
[4,"5 Braån vid Asmundtorp","2011-09-27",13.4,9.5,91.286232663866215,8.06,3.1,59.3,60,61,9,3200,"<10",4100,"<5",null,2011,9]
[4,"5 Braån vid Asmundtorp","2011-10-26",8.5,10.6,90.867343351678215,8.02,3.4,59.1,49,59,13,4500,26,5100,"<5",null,2011,10]
[4,"5 Braån vid Asmundtorp","2011-11-29",5.6,12.2,97.181715413036585,8.1199999999999992,12,53.2,58,88,34,3900,33,4500,6,null,2011,11]
[4,"5 Braån vid Asmundtorp","2011-12-22",4.0999999999999996,12.3,94.169824651358752,8.06,3.6,54.3,33,50,20,5800,50,6500,"<5",null,2011,12]
[4,"5 Braån vid Asmundtorp","2012-01-27",1.7,13.4,96.060348598179459,7.91,10,57.5,34,57,24,5600,87,6300,8,null,{"$f":"YEAR(C391)","v":2012},{"$f":"MONTH(C391)","v":1}]
[4,"5 Braån vid Asmundtorp","2012-02-28",3.4,13,97.666706895100944,7.82,15,45.4,48,78,24,4300,200,5600,12,null,2012,2]
[4,"5 Braån vid Asmundtorp","2012-03-29",8.1,11,93.370394992919927,8.18,3.25,58.3,23,35,13,3900,28,4600,"<5",null,2012,3]
[4,"5 Braån vid Asmundtorp","2012-04-25",10.1,9.6999999999999993,86.428478623565113,8.06,6.1,53.3,16,40,18,2600,170,3500,5.5,null,2012,4]
[4,"5 Braån vid Asmundtorp","2012-05-29",14.2,8,78.226360301903526,8,3,63.5,80,120,10,2800,80,3500,"<5",null,2012,5]
[4,"5 Braån vid Asmundtorp","2012-06-26",13.8,9.1,88.212837080291848,7.94,15,49.5,98,160,50,5100,120,6200,14,null,2012,6]
[4,"5 Braån vid Asmundtorp","2012-07-25",17,8.4,87.085826074695476,8.0500000000000007,2.1,56,84,120,20,1700,38,1900,"<5",null,2012,7]
[4,"5 Braån vid Asmundtorp","2012-08-27",16.8,8.9,91.897059388696306,8.0399999999999991,4.9000000000000004,53.9,62,110,17,2300,28,4000,"<5",null,2012,8]
[4,"5 Braån vid Asmundtorp","2012-09-24",11.2,9.6,87.773018847863298,7.88,3.2,35.1,64,98,21,1900,44,2300,9.8000000000000007,null,2012,9]
[4,"5 Braån vid Asmundtorp","2012-10-30",5.9,11.3,90.716730732931964,7.94,49,48.2,46,120,74,3300,"<10",3900,37,null,2012,10]
[4,"5 Braån vid Asmundtorp","2012-11-25",4.9000000000000004,13.1,102.4524566108558,7.72,125,33.9,140,340,180,6900,"<10",7400,92,null,2012,11]
[4,"5 Braån vid Asmundtorp","2012-11-28",6.7,13,106.53186424185515,7.89,24,49.3,48,77,33,7000,37,7800,11,null,2012,11]
[4,"5 Braån vid Asmundtorp","2012-12-20",3.2,15.4,115.06957715364439,7.91,14,50,35,65,22,7200,54,7800,9.4,null,2012,12]
[4,"5 Braån vid Asmundtorp","2013-01-30",1.5,12.8,91.245789644628701,7.87,111,41.5,73,210,180,3100,270,4400,97,null,2013,1]
[4,"5 Braån vid Asmundtorp","2013-02-26",2.5,13.5,98.954050253112982,8.07,2.9,55.9,20,34,12,5600,41,5900,"<5",null,2013,2]
[4,"5 Braån vid Asmundtorp","2013-03-26",1.2,14.7,103.90812060943063,8.1300000000000008,2.5,57.9,12,25,14,4800,140,5000,"<5",null,2013,3]
[4,"5 Braån vid Asmundtorp","2013-04-25",9.4,11.9,104.27018923557203,8.19,1.7,52,7,20,7,2900,17,3300,"<5",null,2013,4]
[4,"5 Braån vid Asmundtorp","2013-05-29",14,8.6999999999999993,84.703336085062787,7.95,2.4,59.2,64,93,53,2700,89,3400,5.4,null,2013,5]
[4,"5 Braån vid Asmundtorp","2013-06-26",15.3,8.3000000000000007,83.086605012177984,7.9,2.8,61.7,110,130,20,2700,84,2800,"<5",null,2013,6]
[4,"5 Braån vid Asmundtorp","2013-07-25",17.3,7.2,75.096360086926424,7.94,2.2999999999999998,63.5,81,110,18,1800,41,2400,"<5",null,2013,7]
[4,"5 Braån vid Asmundtorp","2013-08-27",15.9,8.6999999999999993,88.189312356181276,8.01,1.5,64.8,68,95,7,2700,44,3300,"<5",null,2013,8]
[4,"5 Braån vid Asmundtorp","2013-09-26",10.7,10.3,93.082439404041239,7.99,1,63.9,130,2300,"<5",4300,29,4900,"<5",null,2013,9]
[4,"5 Braån vid Asmundtorp","2013-10-29",10.8,9.3000000000000007,84.242226586436189,7.97,23,50.2,72,120,40,6500,27,7300,9.5,null,2013,10]
[4,"5 Braån vid Asmundtorp","2013-11-27",4.2,12.8,98.260694382434238,7.97,3.4,57.9,38,64,13,6800,40,7500,"<5",null,2013,11]
[4,"5 Braån vid Asmundtorp","2013-12-23",5.7,12.1,96.636319443944188,7.97,11,49.2,30,54,15,7800,30,7900,9,null,2013,12]
[4,"5 Braån vid Asmundtorp","2014-01-28",0.1,14.2,97.274336444944964,7.99,9.9,56.9,36,54,14,6100,130,6900,"<5",null,2014,1]
[4,"5 Braån vid Asmundtorp","2014-02-27",4.5999999999999996,12.7,98.538185525285002,7.97,9,50.7,32,44,"<5",6100,64,6400,"<5",null,2014,2]
[4,"5 Braån vid Asmundtorp","2014-03-27",4.9000000000000004,13.3,104.01661625376963,8.19,3.2,49.5,10,26,10,3600,"<10",4500,"<5",null,2014,3]
[4,"5 Braån vid Asmundtorp","2014-04-29",12.6,10.3,97.228466639194608,7.96,1.4,55.5,9,25,6,3500,22,4400,"<5",null,2014,4]
[4,"5 Braån vid Asmundtorp","2014-05-28",13.8,9.1999999999999993,89.182208916339007,7.94,2.2000000000000002,57.9,64,86,11,4500,33,5700,"<5",null,2014,5]
[4,"5 Braån vid Asmundtorp","2014-06-24",13.9,9.6,93.262743628243825,7.94,2.2999999999999998,62.2,45,76,14,3300,27,3800,7.5,null,2014,6]
[4,"5 Braån vid Asmundtorp","2014-07-21",19.100000000000001,8.3000000000000007,89.671703457838206,7.92,1.6,61.6,120,150,10,2000,39,2400,"<5",null,2014,7]
[4,"5 Braån vid Asmundtorp","2014-08-28",15.4,9.3000000000000007,93.292936128025389,7.94,2.5,57.9,85,120,10,1700,24,2500,"<5",null,2014,8]
[4,"5 Braån vid Asmundtorp","2014-09-30",12.5,8.9,83.824390127236114,8.01,1.4,60.2,84,97,"<5",2100,19,2600,"<5",null,2014,9]
[4,"5 Braån vid Asmundtorp","2014-10-29",10.9,10.3,93.518647877712212,7.97,4.5999999999999996,57.3,59,77,11,6800,24,7900,"<5",null,2014,10]
[4,"5 Braån vid Asmundtorp","2014-11-27",7,11.8,97.438207496559613,8.11,6.1,58.6,52,67,8,6600,23,7200,"<5",null,2014,11]
[4,"5 Braån vid Asmundtorp","2014-12-22",7,11.1,91.657974848458608,7.68,400,32.299999999999997,110,490,360,5400,23,7000,220,"grumligt",2014,12]
[4,"5 Braån vid Asmundtorp","2015-01-27",3.6,12.4,93.665487208760396,7.83,104,48.7,63,200,140,5800,40,7100,52,null,2015,1]
[4,"5 Braån vid Asmundtorp","2015-02-24",3.5,13,97.932082466542226,7.99,36,45.9,52,70,26,6300,22,6600,18,null,2015,2]
[4,"5 Braån vid Asmundtorp","2015-03-31",4.3,11,84.668832146123322,7.79,65,41.9,110,200,100,13000,260,14000,37,null,2015,3]
[4,"5 Braån vid Asmundtorp","2015-04-29",9.3000000000000007,11.6,101.39659174708385,8.19,1.85,52.75,8.6999999999999993,28,5,4100,200,4600,"<5",null,2015,4]
[4,"5 Braån vid Asmundtorp","2015-05-27",11.8,10.199999999999999,94.555497328972223,8.17,2.2999999999999998,55.6,26,51,18,1100,13,4500,"<5",null,2015,5]
[4,"5 Braån vid Asmundtorp","2015-06-25",13.3,9.3000000000000007,89.167547784999897,8,2.7,56.5,77,110,10,2600,51,3400,"<5",null,2015,6]
[4,"5 Braån vid Asmundtorp","2015-07-28",16.100000000000001,8.5,86.519168508453077,7.93,7.2,46.9,63,150,30,2100,44,2500,6.9,null,2015,7]
[4,"5 Braån vid Asmundtorp","2015-08-26",16.100000000000001,8.5,86.519168508453077,7.84,3.5,50,98,140,20,2400,64,3100,"<5",null,2015,8]
[4,"5 Braån vid Asmundtorp","2015-09-30",11.7,10.7,98.963843132663314,8.0399999999999991,2.5,62.4,42,85,"<5",3600,31,3500,"<5",null,2015,9]
[4,"5 Braån vid Asmundtorp","2015-10-28",8.8000000000000007,10,86.356007011940804,7.98,1.4,61.7,62,89,9,3000,"<10",3400,"<5",null,2015,10]
[4,"5 Braån vid Asmundtorp","2015-12-21",7.9,11.2,94.597223672714762,7.99,12.3,53.41,38,66,"<5",6900,40,7100,5.5,null,2015,12]
[4,"5 Braån vid Asmundtorp","2016-01-27",3.9,12.3,93.665315358700624,7.86,29,38.9,40,120,22,4300,29,4800,37,null,2016,1]
[4,"5 Braån vid Asmundtorp","2016-02-25",3.4,11.9,89.402600927053939,8.01,9.6999999999999993,47.65,32,61,7,6500,"<10",6400,13,null,2016,2]
[4,"5 Braån vid Asmundtorp","2016-03-30",7.2,11.9,98.762147270944581,8.23,2.2999999999999998,51.5,6.1,23,9,3900,"<10",3900,"<5",null,2016,3]
[4,"5 Braån vid Asmundtorp","2016-04-27",6.4,10.6,86.200731271056128,8.0399999999999991,7.8,43.5,8.5,34,25,3000,"<10",3700,7.8,null,2016,4]
[4,"5 Braån vid Asmundtorp","2016-05-31",18.3,8.5,90.425010629845701,7.94,2.8,60.9,94,120,10,2500,67,3200,"<5",null,2016,5]
[4,"5 Braån vid Asmundtorp","2016-06-28",17.8,7.2,75.8469600573154,7.89,4.0999999999999996,48.3,120,180,10,1900,94,2100,5.4,null,2016,6]
[4,"5 Braån vid Asmundtorp","2016-07-26",19.100000000000001,7.3,78.867883764122752,7.97,3.6,61.4,85,120,"<5",1900,40,2200,"<5",null,2016,7]
[4,"5 Braån vid Asmundtorp","2016-08-30",16.2,8.8000000000000007,89.757570242673751,7.89,3.6,58.6,96,120,10,3200,31,3200,"<5",null,2016,8]
[4,"5 Braån vid Asmundtorp","2016-09-27",14.2,9.6,93.871632362284231,8.1,4.0999999999999996,67.5,60,94,20,2800,33,3300,"<5",null,2016,9]
[4,"5 Braån vid Asmundtorp","2016-10-26",6,10.9,87.732215894721676,7.9,2.2000000000000002,54,41,120,10,2500,20,2900,"<5",null,2016,10]
[4,"5 Braån vid Asmundtorp","2016-11-29",2.7,14,103.18616773146636,8.0399999999999991,1.9,60.7,11,75,"<5",6600,19,7300,"<5",null,2016,11]
[4,"5 Braån vid Asmundtorp","2016-12-28",3.2,12.7,null,8.0399999999999991,3.7,72.5,35,59,8,12000,23,12000,6.5,null,2016,12]
[4,"5 Braån vid Asmundtorp","2017-01-31",3.1,12.9,96.126816507001976,8.02,3.3,59.4,28,46,"<5",9900,37,9800,"<5",null,2017,1]
[4,"5 Braån vid Asmundtorp","2017-02-28",5,11.7,91.745048379395087,7.88,32,47.9,57,95,38,14000,72,14000,18,null,2017,2]
[4,"5 Braån vid Asmundtorp","2017-03-28",6.5,11.6,94.57484887069397,8.07,3.3,55.8,8.6,25,"<5",9100,"<10",9300,"<5",null,2017,3]
[4,"5 Braån vid Asmundtorp","2017-04-26",7.9,12,101.35416822076581,8.2100000000000009,1.8,54.6,5.6,19,5,5600,"<10",6000,"<5",null,2017,4]
[4,"5 Braån vid Asmundtorp","2017-05-30",15.7,7.8,78.738232233532756,7.9,4.0999999999999996,63.7,110,130,20,2700,110,3100,"<5",null,{"$f":"YEAR(C455)","v":2017},{"$f":"MONTH(C455)","v":5}]
[4,"5 Braån vid Asmundtorp","2017-06-27",14.4,8.4,82.49266036946841,7.98,3,52.4,99,130,10,2700,42,3200,5.6,null,2017,6]
[4,"5 Braån vid Asmundtorp","2017-07-31",16.100000000000001,8.1999999999999993,83.465550796390033,7.96,3.6,57.2,94,120,20,1300,33,1600,"<5",null,2017,7]
[4,"5 Braån vid Asmundtorp","2017-08-29",16.5,9.4,96.469026233690244,8.0299999999999994,3.3,56.7,58,78,10,3400,31,4000,"<5",null,2017,8]
[4,"5 Braån vid Asmundtorp","2017-09-25",14.8,9.4,93.107079976838321,8.01,3.5,59.3,57,78,10,6200,19,6800,"<5",null,2017,9]
[4,"5 Braån vid Asmundtorp","2017-10-31",7.6,11,92.215110149422401,7.92,37,50.2,62,100,28,7900,31,7200,12,null,2017,10]
[4,"5 Braån vid Asmundtorp","2017-11-21",4.3,12.3,94.675148672483346,7.97,10,54.7,38,73,33,7600,44,7700,"<5",null,2017,11]
[4,"5 Braån vid Asmundtorp","2017-12-28",5.4,11.2,88.751474149172324,7.9,27,48.5,49,82,32,6500,100,6500,18,null,2017,12]
[4,"5 Braån vid Asmundtorp","2018-01-30",4.4000000000000004,12.6,97,7.96,71,72.8,50,250,200,5600,42,5800,41,null,2018,1]
[4,"5 Braån vid Asmundtorp","2018-02-28",0.1,14,96,7.96,8.4,60.6,39,63,20,5800,180,6000,6.6,"is",2018,2]
[4,"5 Braån vid Asmundtorp","2018-03-27",3.7,11.9,90,8.06,9,52.3,28,48,16,4900,84,5400,8.5,null,2018,3]
[4,"5 Braån vid Asmundtorp","2018-04-25",9.8000000000000007,9.6999999999999993,86,8.02,4.9000000000000004,58.1,"<2",34,15,3900,12,4100,"<5",null,2018,4]
[4,"5 Braån vid Asmundtorp","2018-05-29",17.7,8.8000000000000007,93,7.88,5.6,55.7,92,130,"<5",4500,97,4900,5.0999999999999996,null,2018,5]
[4,"5 Braån vid Asmundtorp","2018-06-18",15.8,9.1,92,7.94,3.7,66.2,null,null,null,null,null,null,null,"Proverna försvunna ",2018,6]
[4,"5 Braån vid Asmundtorp","2018-07-16",19.7,7.6,83,8.01,4.5999999999999996,66.5,72,130,10,1100,35,1400,"<5",null,2018,7]
[4,"5 Braån vid Asmundtorp","2018-08-28",15.1,8.6,86,7.78,3.4,67.3,88,110,14,1400,24,1900,"<5",null,2018,8]
[4,"5 Braån vid Asmundtorp","2018-10-30",7.7,11.1,93,7.83,2.5,51.3,32,82,18,2200,12,2500,"<5",null,2018,10]
[4,"5 Braån vid Asmundtorp","2018-11-27",0.3,12.8,88,7.88,1.8,70.8,80,95,10,4400,46,4400,"<5",null,2018,11]
[4,"5 Braån vid Asmundtorp","2018-12-20",3.7,13.4,101,7.89,2.4,68.400000000000006,44,57,"<5",14000,89,13000,"<5",null,2018,12]
[4,"5 Braån vid Asmundtorp","2019-01-29",2.8,13,96,7.91,33,56.3,45,96,47,18000,77,18000,18,null,2019,1]
[4,"5 Braån vid Asmundtorp","2019-02-26",5.5,12.6,100,8,4.8,57.1,25,37,7,16000,36,15000,"<5",null,2019,2]
[4,"5 Braån vid Asmundtorp","2019-03-26",6,11.7,94,7.95,5,51.6,27,43,19,9000,56,9000,"<5",null,2019,3]
[4,"5 Braån vid Asmundtorp","2019-04-23",10.6,10.3,93,8.06,2.6,58.9,12,34,12,5700,16,5500,"<5",null,2019,4]
[4,"5 Braån vid Asmundtorp","2019-05-27",12.8,8.1,77,8.0500000000000007,3.4,62.2,82,110,22,3000,48,3500,"<5",null,2019,5]
[4,"5 Braån vid Asmundtorp","2019-06-24",15.6,8.3000000000000007,84,7.91,3.9,51,110,150,10,3300,32,3500,"<5",null,2019,6]
[4,"5 Braån vid Asmundtorp","2019-07-22",16.5,7.8,80,7.97,9,65.900000000000006,140,160,20,1800,26,2300,5.4,null,2019,7]
[4,"5 Braån vid Asmundtorp","2019-08-27",18.5,7.7,82,7.82,5.0999999999999996,57.1,130,160,20,1300,25,1700,"<5",null,2019,8]
[4,"5 Braån vid Asmundtorp","2019-09-25",11.1,10.8,99,7.78,3.7,57.3,69,91,12,1700,35,2500,"<5",null,2019,9]
[4,"5 Braån vid Asmundtorp","2019-09-26",13.3,9.3000000000000007,89,7.95,3.3,67.099999999999994,72,110,11,2900,15,3200,"<5",null,2019,9]
[4,"5 Braån vid Asmundtorp","2019-10-21",11.4,9.9,91,7.9,11,55.3,51,81,20,10000,19,11000,"<5",null,2019,10]
[4,"5 Braån vid Asmundtorp","2019-11-25",7.1,11.6,96,8.0399999999999991,3.9,59.9,32,50,18,8600,20,9400,"<5",null,2019,11]
[4,"5 Braån vid Asmundtorp","2019-12-19",5.4,12.2,97,7.9,15.2,50.6,28,78,34,9900,36,11000,10,null,2019,12]
[5,"28:2 Bäck N Trolleholm","2010-02-22",0.1,13.9,95.21924482991092,7.85,21,42.6,8,75,null,910,43,1400,54,null,2010,2]
[5,"28:2 Bäck N Trolleholm","2010-03-24",1.5,13,92.671505107826022,7.6,10,22.6,11,32,null,3600,36,3900,7.9,null,2010,3]
[5,"28:2 Bäck N Trolleholm","2010-05-27",11.3,8.9,81.561444401928256,8.16,3.1,44.5,6,11,null,340,20,580,"<5",null,2010,5]
[5,"28:2 Bäck N Trolleholm","2010-08-25",18.899999999999999,9.5,102.24385315923845,8.09,6.3,37.5,8,31,null,610,19,1300,"<5",null,2010,8]
[5,"28:2 Bäck N Trolleholm","2010-10-26",4.0999999999999996,11.3,86.513741346370239,7.8,23,33.9,10,40,null,5800,"<10",6100,11,null,2010,10]
[5,"28:2 Bäck N Trolleholm","2010-12-21",0.2,13.2,90.684440334561373,7.85,4.8,39.5,3,"<5",null,1100,25,1400,"<5","istäckt",2010,12]
[5,"28:2 Bäck N Trolleholm","2011-02-24",0.1,14.5,99.329428059979008,7.91,6.4,41.9,4,8.4,null,1100,41,1300,"<5","taget i \"fönster\", i övrigt istäckt",2011,2]
[5,"28:2 Bäck N Trolleholm","2011-03-29",1.9,13.1,94.436224345513736,8.07,2.5,35.6,3,13,null,1300,14,1500,"<5",null,2011,3]
[5,"28:2 Bäck N Trolleholm","2011-05-24",11.5,9.3000000000000007,85.621196296669282,7.95,5.0999999999999996,40.5,"<2",18,null,210,23,550,5.3,null,2011,5]
[5,"28:2 Bäck N Trolleholm","2011-08-30",12.9,10.7,101.6843052887039,8.06,12,41.5,10,27,null,1000,12,1500,12,null,2011,8]
[5,"28:2 Bäck N Trolleholm","2011-10-26",12.7,10.6,100.28492205491359,7.98,4.3,46.5,5,12,null,920,"<10",1100,"<5",null,2011,10]
[5,"28:2 Bäck N Trolleholm","2011-12-22",2.4,12.6,92.102263366818306,8.01,3.8,41,4,10,null,2000,21,2300,"<5",null,2011,12]
[5,"28:2 Bäck N Trolleholm","2012-02-28",1.2,15,106.02869449941899,7.45,10,30.7,7,20,null,1600,66,2400,11,"översvämmat, is",2012,2]
[5,"28:2 Bäck N Trolleholm","2012-03-29",4.9000000000000004,11.5,89.939179467545173,8.14,5.5,40,5,13,"<13",940,18,1100,"<5",null,2012,3]
[5,"28:2 Bäck N Trolleholm","2012-05-29",11.6,9.6,88.5865764370227,8.06,9.6,47,4,30,null,620,31,740,5.6,null,2012,5]
[5,"28:2 Bäck N Trolleholm","2012-08-27",16.5,7.5,76.969967739646464,7.79,15,39.700000000000003,16,51,null,440,42,1200,12,null,2012,8]
[5,"28:2 Bäck N Trolleholm","2012-10-30",5.0999999999999996,11,86.483439199742932,7.69,24,35.700000000000003,4,23,null,1200,"<10",1800,23,null,2012,10]
[5,"28:2 Bäck N Trolleholm","2012-12-20",1.7,12.1,86.741061047609804,7.9,15,39.200000000000003,4,13,null,2400,30,2900,"<5",null,2012,12]
[5,"28:2 Bäck N Trolleholm","2013-02-26",0.8,13.2,92.253340591094044,8.02,5.8,39.299999999999997,2,14,null,1000,41,1200,"<5","kalhygge uppstr",2013,2]
[5,"28:2 Bäck N Trolleholm","2013-03-26",0,14,95.628415300546436,7.85,2.1,45.8,2,6.5,null,680,16,880,"<5","is",2013,3]
[5,"28:2 Bäck N Trolleholm","2013-05-29",11.5,9.6999999999999993,89.303828395450751,8.02,3.1,45.8,7,14,null,180,29,540,"<5",null,2013,5]
[5,"28:2 Bäck N Trolleholm","2013-08-27",13.2,9.3000000000000007,88.97065097067663,7.96,9.8000000000000007,42.2,12,42,null,330,110,850,"<5",null,2013,8]
[5,"28:2 Bäck N Trolleholm","2013-10-29",10,9.3000000000000007,82.667723282888232,7.73,12,34.799999999999997,6,36,null,3300,58,4200,"<5",null,2013,10]
[5,"28:2 Bäck N Trolleholm","2013-12-23",4.2,11.7,89.816415958943793,7.83,3.6,37.6,5,12,null,2400,18,3100,"<5",null,2013,12]
[5,"28:2 Bäck N Trolleholm","2014-02-27",3.2,12.9,96.389450992338482,7.86,7.3,37,5,21,null,1300,28,1400,"<5",null,2014,2]
[5,"28:2 Bäck N Trolleholm","2014-03-27",2,13.5,97.591470348639291,7.93,8.4,35.9,5,14,null,1500,21,1900,6,null,2014,3]
[5,"28:2 Bäck N Trolleholm","2014-05-28",9.6,10.1,88.924924061249584,8.07,3.9,46.3,4.2,16,null,430,21,750,"<5",null,2014,5]
[5,"28:2 Bäck N Trolleholm","2014-08-28",13.5,10.1,97.265451473724312,8,7.9,48.9,7.1,30,null,170,19,500,10,"grävning uppstr, drän orsakat dämning",2014,8]
[5,"28:2 Bäck N Trolleholm","2014-10-29",9,10.4,90.248864496715626,7.72,2.5,47.7,4.8,19,null,1400,"<10",1800,"<5",null,2014,10]
[5,"28:2 Bäck N Trolleholm","2014-12-22",6.9,10.8,88.954834383322165,7.34,95,17.899999999999999,7,110,null,3400,18,4500,110,"rinner över vägen",2014,12]
[5,"28:2 Bäck N Trolleholm","2015-02-24",3,13,96.607555126794324,7.81,8.6,31.9,7,22,null,1900,22,2400,5.8,null,2015,2]
[5,"28:2 Bäck N Trolleholm","2015-03-31",3.8,11.2,85.059330739682466,7.81,32,25,22,50,null,2800,17,3500,15,null,2015,3]
[5,"28:2 Bäck N Trolleholm","2015-05-27",9.5,10.7,93.981541750149603,8.15,4.0999999999999996,45.3,5.2,19,null,51,"<10",670,6.3,null,{"$f":"YEAR(C519)","v":2015},{"$f":"MONTH(C519)","v":5}]
[5,"28:2 Bäck N Trolleholm","2015-08-26",14.5,10.1,99.400935539982811,8.0299999999999994,9.6,51.7,12,36,null,150,20,800,7.8,null,2015,8]
[5,"28:2 Bäck N Trolleholm","2015-10-28",6.7,10.3,84.406015514700627,7.92,3.7,58,6.1,18,null,"<10","<10",480,5.5,null,2015,10]
[5,"28:2 Bäck N Trolleholm","2015-12-21",7.6,10.6,88.861833416716124,7.9,2.7,40.4,3.9,10,null,1900,12,2500,"<5",null,2015,12]
[5,"28:2 Bäck N Trolleholm","2016-02-25",1.9,12.11,87.299440978944375,7.85,3.8,32.9,4,14,null,1700,"<10",2100,"<5",null,2016,2]
[5,"28:2 Bäck N Trolleholm","2016-03-30",4.4000000000000004,11.5,88.75392422678128,8.02,3.3,39.799999999999997,2.9,25,null,620,"<10",940,"<5",null,2016,3]
[5,"28:2 Bäck N Trolleholm","2016-05-31",16.100000000000001,8.8000000000000007,89.57278622051615,7.99,4.8,49.4,9,30,null,160,20,760,5.8,null,2016,5]
[5,"28:2 Bäck N Trolleholm","2016-08-30",13.2,9.1,87.057303637973888,7.81,19,42.4,11,57,null,180,"<10",540,22,null,2016,8]
[5,"28:2 Bäck N Trolleholm","2016-10-26",6.8,10.1,82.978097271895763,7.8,3.55,53,4.7,18,null,37,10,420,"<5",null,2016,10]
[5,"28:2 Bäck N Trolleholm","2016-12-28",0.5,14.3,null,8,2.1,50.4,5,9.1999999999999993,null,1600,"<10",2100,"<5",null,2016,12]
[5,"28:2 Bäck N Trolleholm","2017-02-28",4.4000000000000004,11.5,88.75392422678128,7.7,6.8,33.4,3,18,null,4200,12,4500,5.7,null,2017,2]
[5,"28:2 Bäck N Trolleholm","2017-03-28",4.9000000000000004,11.6,90.721259289002091,8.02,1.6,44.6,2.8,7.6,null,1100,13,1600,"<5",null,2017,3]
[5,"28:2 Bäck N Trolleholm","2017-05-30",13.1,8.9,84.955503937634788,7.99,3.9,53.2,8.6,20,null,260,27,590,"<5",null,2017,5]
[5,"28:2 Bäck N Trolleholm","2017-08-29",13.7,10.1,97.69289193326621,8.0500000000000007,6.9,50.9,12,32,null,400,73,850,8.3000000000000007,null,2017,8]
[5,"28:2 Bäck N Trolleholm","2017-10-31",4.3,12.8,98.523731951852582,7.75,7.1,35.799999999999997,5.5,24,null,1300,22,1800,"<5",null,2017,10]
[5,"28:2 Bäck N Trolleholm","2017-12-28",4.7,11.5,89.464544136535167,7.78,8.8000000000000007,30.4,9.1999999999999993,19,null,1000,33,1500,7.6,null,2017,12]
[5,"28:2 Bäck N Trolleholm","2018-02-28",0.1,13.2,90,7.71,7,50.9,4.4000000000000004,15,null,710,51,1000,9.6999999999999993,"is",2018,2]
[5,"28:2 Bäck N Trolleholm","2018-03-27",0.9,12.9,90,7.96,12,34.1,8.3000000000000007,29,null,1100,43,1400,11,null,2018,3]
[5,"28:2 Bäck N Trolleholm","2018-05-29",15.4,8.6,86,7.94,14,52,6.4,37,null,490,30,940,13,null,2018,5]
[5,"28:2 Bäck N Trolleholm","2018-08-28",13.1,8.8000000000000007,84,7.52,5,41.2,7.3,24,null,220,26,680,"<5",null,2018,8]
[5,"28:2 Bäck N Trolleholm","2018-10-30",7.1,10.6,88,7.64,2.2000000000000002,44.1,"<2",8,null,220,17,480,"<5",null,2018,10]
[5,"28:2 Bäck N Trolleholm","2018-12-20",3.3,11.3,85,7.81,1,75.3,3.5,7,null,2500,16,2800,"<5",null,2018,12]
[5,"28:2 Bäck N Trolleholm","2019-02-26",6,14.3,115,7.95,1.5,51.7,2.1,7,null,2800,"<10",3300,"<5",null,2019,2]
[5,"28:2 Bäck N Trolleholm","2019-03-26",6.6,11.6,95,7.89,2.2999999999999998,43.9,4,8,null,1600,"<10",1900,"<5",null,2019,3]
[5,"28:2 Bäck N Trolleholm","2019-05-27",11.9,7.4,69,8.0500000000000007,0.7,57.8,"<2",12,null,150,18,530,"<5",null,2019,5]
[5,"28:2 Bäck N Trolleholm","2019-08-27",19,7.5,81,7.75,4.9000000000000004,42.7,8.3000000000000007,36,null,250,57,690,11,null,2019,8]
[5,"28:2 Bäck N Trolleholm","2019-10-21",10.6,9.4,85,7.8,1.7,60.6,2.1,12,null,2800,"<10",3000,"<5",null,2019,10]
[5,"28:2 Bäck N Trolleholm","2019-12-19",5.2,12,95,7.75,3.6,43.3,3,17,null,2900,34,3300,"<5",null,2019,12]
[6,"26 Långropen uppstr Eslöv","2010-01-26",-0.2,15.1,102.54808958035122,7.66,5.35,69.2,33,34,26,3800,150,4600,"<5",null,2010,1]
[6,"26 Långropen uppstr Eslöv","2010-02-22",0.1,12.4,84.943786754740685,7.71,6.1,68.349999999999994,39,56,29,3400,340,4100,14,null,2010,2]
[6,"26 Långropen uppstr Eslöv","2010-03-24",2.2999999999999998,11.7,85.287114595812426,7.56,21,33.4,66,99,34,6200,72,7500,14,null,2010,3]
[6,"26 Långropen uppstr Eslöv","2010-04-27",9.1,6.2,53.93301016469767,7.8,2.2000000000000002,57,5,11,5,3500,46,4000,"<5",null,2010,4]
[6,"26 Långropen uppstr Eslöv","2010-05-27",11.1,9.4,85.745296255616935,7.9,2.2999999999999998,56.4,6,22,10,1900,23,2600,"<5",null,2010,5]
[6,"26 Långropen uppstr Eslöv","2010-06-23",14.5,7.95,78.24133044978845,8.17,2,59.7,40,65,"<5",1400,41,1900,"<5",null,2010,6]
[6,"26 Långropen uppstr Eslöv","2010-07-19",15.3,8.07,80.784205114250156,7.79,2.2000000000000002,65.75,65,79,12,1100,19,1200,"<5",null,2010,7]
[6,"26 Långropen uppstr Eslöv","2010-08-25",19.100000000000001,null,null,7.8,5.2,48.3,56,81,23,7700,17,8200,"<5",null,2010,8]
[6,"26 Långropen uppstr Eslöv","2010-09-28",10.5,8.6,77.355200614300642,7.87,2.9,59.9,36,48,25,6100,17,6800,"<5",null,2010,9]
[6,"26 Långropen uppstr Eslöv","2010-10-26",6.7,10,81.94758787835012,7.6,47,41.8,76,130,68,11000,10,10000,13,null,2010,10]
[6,"26 Långropen uppstr Eslöv","2010-11-23",5,10.5,82.335299827662269,7.59,51,41.8,62,120,57,7200,21,7700,17,null,2010,11]
[6,"26 Långropen uppstr Eslöv","2010-12-21",0.1,11.9,81.518634063017259,7.75,5.7,59.4,25,34,24,5400,52,5900,"<5","istäckt",2010,12]
[6,"26 Långgropen uppstr Eslöv","2011-01-27",1.1000000000000001,12.6,88.812660895168321,7.6,13,45.9,39,56,25,5900,43,6000,"<5",null,2011,1]
[6,"26 Långgropen uppstr Eslöv","2011-02-24",0.1,14.3,97.959366983289655,7.85,5.2,61.3,28,36,16,4900,560,6300,"<5","endast delvis öppet vatten",2011,2]
[6,"26 Långgropen uppstr Eslöv","2011-03-29",3.2,11.6,86.675785388459403,7.87,3.3,53.3,9,23,16,4900,52,6000,"<5",null,2011,3]
[6,"26 Långgropen uppstr Eslöv","2011-04-27",10.6,9.3000000000000007,83.848417874528664,7.84,2.5,59.3,19,35,24,4600,430,5600,"<5",null,2011,4]
[6,"26 Långgropen uppstr Eslöv","2011-05-24",13,7.2,68.575574254806654,7.73,3.4,58.5,45,57,19,3000,88,2900,"<5",null,2011,5]
[6,"26 Långgropen uppstr Eslöv","2011-06-28",14.2,8.3000000000000007,81.159848813224926,7.76,2.5,62,57,68,22,1600,27,3400,"<5",null,2011,6]
[6,"26 Långgropen uppstr Eslöv","2011-07-27",14.7,7.7,76.106059675338017,7.82,3.6,50.8,53,79,13,2800,23,3500,"<5",null,2011,7]
[6,"26 Långgropen uppstr Eslöv","2011-08-30",13.8,8.3000000000000007,80.457862391914546,7.78,5.8,51.3,44,64,16,5100,17,5900,"<5",null,2011,8]
[6,"26 Långgropen uppstr Eslöv","2011-09-27",12.2,8.6,80.45219242439056,7.92,3.3,61.9,48,47,19,3400,28,4000,"<5",null,2011,9]
[6,"26 Långgropen uppstr Eslöv","2011-10-26",8.4,9.6999999999999993,82.947956707869537,7.81,3.3,60.4,36,42,7,4700,27,5200,"<5",null,2011,10]
[6,"26 Långgropen uppstr Eslöv","2011-11-29",5.7,11.2,89.448494030758255,7.94,11,54.9,43,69,28,6100,36,5800,6,null,2011,11]
[6,"26 Långgropen uppstr Eslöv","2011-12-22",4.0999999999999996,11.3,86.513741346370239,7.79,5.0999999999999996,55.7,25,38,18,6700,39,7900,"<5",null,2011,12]
[6,"26 Långgropen uppstr Eslöv","2012-01-27",1.7,12.8,91.759138959455015,7.67,7.8,56,21,43,25,5900,64,6500,8.4,null,2012,1]
[6,"26 Långgropen uppstr Eslöv","2012-02-28",2.5,13.3,97.488064323437243,7.47,19,46.6,32,66,28,4500,140,5600,13,null,2012,2]
[6,"26 Långgropen uppstr Eslöv","2012-03-29",6,10.8,86.92733318009121,7.97,4.5,58,22,43,22,3900,190,4700,"<5",null,2012,3]
[6,"26 Långgropen uppstr Eslöv","2012-04-25",9,9,78.099978891388517,7.88,4.5999999999999996,57.2,20,38,19,2500,41,3200,"<5",null,2012,4]
[6,"26 Långgropen uppstr Eslöv","2012-05-29",13.8,9.6,93.059696260527673,7.88,3.8,63.6,24,81,30,2000,70,2500,"<5",null,2012,5]
[6,"26 Långgropen uppstr Eslöv","2012-06-26",12.9,8.8000000000000007,83.628213695382655,7.85,17,45.8,89,140,30,3900,84,5100,"<5",null,2012,6]
[6,"26 Långgropen uppstr Eslöv","2012-07-25",14.9,7.6,75.438412851584317,7.79,2.2000000000000002,64,50,68,16,1300,22,1700,"<5",null,2012,7]
[6,"26 Långgropen uppstr Eslöv","2012-08-27",15.8,9.1,92.05267017989226,7.89,1.4,66.7,42,62,11,1100,18,1900,"<5",null,2012,8]
[6,"26 Långgropen uppstr Eslöv","2012-09-24",10.199999999999999,9,80.381758016967368,7.77,2.4,60.5,47,69,18,1200,12,1600,"<5",null,2012,9]
[6,"26 Långgropen uppstr Eslöv","2012-10-30",5.6,9.8000000000000007,78.064000905553982,7.74,3.2,62.6,43,72,30,2600,10,3300,"<5",null,2012,10]
[6,"26 Långgropen uppstr Eslöv","2012-11-25",5.0999999999999996,11.6,91.200717701547092,7.29,62,25.2,100,190,70,7200,31,7700,36,null,2012,11]
[6,"26 Långgropen uppstr Eslöv","2012-11-28",6.7,10.8,88.503394908618134,7.73,12,50.6,35,55,16,7400,18,8400,5.6,null,2012,11]
[6,"26 Långgropen uppstr Eslöv","2012-12-20",2.7,12,88.445286626971168,7.65,7.3,47.9,29,44,7,7800,11,8700,"<5",null,{"$f":"YEAR(C583)","v":2012},{"$f":"MONTH(C583)","v":12}]
[6,"26 Långgropen uppstr Eslöv","2013-01-30",2.2999999999999998,12.8,93.305561267213605,7.59,100,28.7,76,200,170,2800,"<10",4200,99,null,2013,1]
[6,"26 Långgropen uppstr Eslöv","2013-02-26",2.1,12.2,88.439556502555547,7.87,4.2,57.3,14,31,14,5000,45,5200,"<5",null,2013,2]
[6,"26 Långgropen uppstr Eslöv","2013-03-26",0,13.9,94.945355191256837,7.91,6.1,60.4,11,29,22,4200,15,4200,6.8,"is i kanten",2013,3]
[6,"26 Långgropen uppstr Eslöv","2013-04-25",8.5,10.9,93.439060616348357,7.93,1.8,55.9,4,15,5.9,2400,10,2700,"<5",null,2013,4]
[6,"26 Långgropen uppstr Eslöv","2013-05-29",10.9,7,63.556362635338395,7.81,2.8,61.3,37,59,19,1400,74,1800,"<5",null,2013,5]
[6,"26 Långgropen uppstr Eslöv","2013-06-26",13.9,8.1999999999999993,79.661926849124924,7.77,1.7,60.6,42,61,14,1000,21,1500,"<5",null,2013,6]
[6,"26 Långgropen uppstr Eslöv","2013-07-25",14.6,7,69.039552454229735,7.65,1.4,66,42,54,17,620,11,1000,"<5",null,2013,7]
[6,"26 Långgropen uppstr Eslöv","2013-08-27",12.9,7.1,67.472763322410998,7.68,1,66.900000000000006,38,56,13,820,16,1200,"<5",null,2013,8]
[6,"26 Långgropen uppstr Eslöv","2013-09-26",8.1999999999999993,8.6,73.179540982933759,7.69,0.75,61.7,37,43,"<5",1100,21,1400,"<5",null,2013,9]
[6,"26 Långgropen uppstr Eslöv","2013-10-29",10.4,8.6,77.173182152974064,7.75,26,47.7,63,100,29,9600,"<10",11000,11,null,2013,10]
[6,"26 Långgropen uppstr Eslöv","2013-11-27",4.5,11.7,90.538279676760041,7.78,2.1,60.8,23,46,17,6800,39,7200,"<5",null,2013,11]
[6,"26 Långgropen uppstr Eslöv","2013-12-23",5,11.3,88.60846552881749,7.72,6.6,47.3,27,48,12,8500,23,9100,"<5",null,2013,12]
[6,"26 Långgropen uppstr Eslöv","2014-01-28",0.4,13.5,93.279056127194096,7.85,12,58,28,48,21,5700,63,6800,12,null,2014,1]
[6,"26 Långgropen uppstr Eslöv","2014-02-27",4,12.1,92.390353694520329,7.8,5.9,51.3,13,42,13,6100,33,6700,"<5",null,2014,2]
[6,"26 Långgropen uppstr Eslöv","2014-03-27",3.5,12.8,96.425435043980031,7.81,8.1,49.1,9,41,22,5000,83,6200,6.9,null,2014,3]
[6,"26 Långgropen uppstr Eslöv","2014-04-29",9.1999999999999993,8.6999999999999993,75.863791492706127,7.77,2.2999999999999998,58.7,10,30,14,3600,28,4100,"<5",null,2014,4]
[6,"26 Långgropen uppstr Eslöv","2014-05-28",11.7,8.8000000000000007,81.390824258639,7.85,3.2,60.3,39,60,24,3400,53,4500,"<5",null,2014,5]
[6,"26 Långgropen uppstr Eslöv","2014-06-24",11.3,9.1999999999999993,84.310706572779765,7.79,4,60.6,32,81,22,2300,46,3400,"<5",null,2014,6]
[6,"26 Långgropen uppstr Eslöv","2014-07-21",16.600000000000001,7.4,76.098806202631778,7.8,3.6,62.7,63,140,71,1400,48,1900,22,null,2014,7]
[6,"26 Långgropen uppstr Eslöv","2014-08-28",13.8,9.1999999999999993,89.182208916339007,7.83,2.8,57.2,40,70,15,3900,19,5200,"<5",null,2014,8]
[6,"26 Långgropen uppstr Eslöv","2014-09-30",12.1,9,84.003448615608704,7.96,5.3,64.900000000000006,48,65,25,2000,29,2600,5.2,null,2014,9]
[6,"26 Långgropen uppstr Eslöv","2014-10-29",9.6,9.6,84.522700097821385,7.72,4.4000000000000004,59.1,30,54,12,6200,61,7300,"<5",null,2014,10]
[6,"26 Långgropen uppstr Eslöv","2014-11-27",6.8,11.4,93.658446425704128,7.94,8.3000000000000007,58.7,21,45,12,6500,34,7100,7.4,null,2014,11]
[6,"26 Långgropen uppstr Eslöv","2014-12-22",6.8,11.1,91.193750467132958,7.39,268,20.7,130,350,220,4600,25,6100,180,"grumligt",2014,12]
[6,"26 Långgropen uppstr Eslöv","2015-01-27",3.8,12,91.134997221088355,7.64,56,35.1,62,120,57,5900,46,7000,26,null,2015,1]
[6,"26 Långgropen uppstr Eslöv","2015-02-24",3.5,12.7,95.672111332698933,7.8,20,46.5,40,60,18,6000,80,6500,11,null,2015,2]
[6,"26 Långgropen uppstr Eslöv","2015-03-31",4.8,10.9,85.021681858194214,7.62,62,37,130,220,80,11000,340,12000,31,null,2015,3]
[6,"26 Långgropen uppstr Eslöv","2015-04-29",7.2,11.2,92.952609196183118,7.96,2.6,56,3.8,22,"<5",3500,17,4000,"<5",null,2015,4]
[6,"26 Långgropen uppstr Eslöv","2015-05-27",11.1,9.4,85.745296255616935,7.97,3.5,60.3,11,35,24,990,37,3400,"<5",null,2015,5]
[6,"26 Långgropen uppstr Eslöv","2015-06-25",12.3,11.5,107.82509424083861,7.91,6.3,58,32,68,27,2200,42,2800,"<5",null,2015,6]
[6,"26 Långgropen uppstr Eslöv","2015-07-28",14.6,8,78.902345661976852,7.86,5.6,57.1,57,76,21,1900,31,2200,"<5",null,2015,7]
[6,"26 Långgropen uppstr Eslöv","2015-08-26",14.7,8.3000000000000007,82.036401987702021,7.8,2.6,63.2,37,58,14,1400,27,1900,"<5",null,2015,8]
[6,"26 Långgropen uppstr Eslöv","2015-09-30",10.199999999999999,11,98.244370909626781,7.92,3,64.599999999999994,12,54,22,2200,18,2500,"<5",null,2015,9]
[6,"26 Långgropen uppstr Eslöv","2015-10-28",6.4,10.6,86.200731271056128,7.87,3.3,64.900000000000006,51,32,"<5",2000,38,2400,"<5",null,2015,10]
[6,"26 Långgropen uppstr Eslöv","2015-12-21",7.5,10.4,86.967027515151869,7.74,10.6,51.4,24,52,10,6800,36,7200,5.6,null,2015,12]
[6,"26 Långgropen uppstr Eslöv","2016-01-27",4.4000000000000004,12.2,94.15633700580274,7.6,45,36.4,54,130,32,5300,110,6000,43,null,2016,1]
[6,"26 Långgropen uppstr Eslöv","2016-02-25",2.8,11.3,83.51519119928696,7.73,11,47.3,26,52,"<5",6200,20,6100,8.5,null,2016,2]
[6,"26 Långgropen uppstr Eslöv","2016-03-30",6.1,10.4,83.924233212752924,7.91,4.2,55.5,6.7,27,11,4000,21,4100,"<5",null,2016,3]
[6,"26 Långgropen uppstr Eslöv","2016-04-27",4.8,10.5,81.901620138627464,7.89,13,48.1,27,75,53,4800,130,5300,12,null,2016,4]
[6,"26 Långgropen uppstr Eslöv","2016-05-31",17.600000000000001,7.4,77.645507809242261,7.8,6.7,58.3,33,67,22,1500,74,2300,"<5",null,2016,5]
[6,"26 Långgropen uppstr Eslöv","2016-06-28",16.100000000000001,7.4,75.322570230888573,7.8,2.8,61.2,31,73,19,1100,42,1400,"<5",null,2016,6]
[6,"26 Långgropen uppstr Eslöv","2016-07-26",17.899999999999999,7.6,80.218860396793275,7.79,3.2,67.3,29,65,16,1300,35,1600,"<5",null,2016,7]
[6,"26 Långgropen uppstr Eslöv","2016-08-30",14,7.9,76.914523571493802,7.75,3.3,55.7,58,86,16,1500,22,1800,"<5",null,2016,8]
[6,"26 Långgropen uppstr Eslöv","2016-09-27",10.6,8.8000000000000007,79.340438418908846,7.88,1.9,67.400000000000006,26,46,17,1300,18,1600,"<5",null,2016,9]
[6,"26 Långgropen uppstr Eslöv","2016-10-26",7.3,10.9,90.691140411914603,7.93,1.6,61.1,16,56,6,2000,14,2400,"<5",null,2016,10]
[6,"26 Långgropen uppstr Eslöv","2016-11-29",2.2000000000000002,13,94.501035529969073,7.9,2.2000000000000002,62.2,4.0999999999999996,44,7,6500,36,7000,"<5",null,2016,11]
[6,"26 Långgropen uppstr Eslöv","2016-12-28",2.9,12.9,null,7.88,8.1999999999999993,55.5,25,45,"<5",11000,30,11000,"<5",null,2016,12]
[6,"26 Långgropen uppstr Eslöv","2017-01-31",3.3,12.7,95.153835540182016,7.85,2,59.7,20,34,5,7700,28,7500,"<5",null,2017,1]
[6,"26 Långgropen uppstr Eslöv","2017-02-28",4.9000000000000004,11.1,86.810860181717516,7.55,29,38.200000000000003,54,140,75,11000,29,11000,11,null,2017,2]
[6,"26 Långgropen uppstr Eslöv","2017-03-28",5.7,10.8,86.253904958231189,7.88,3.5,56,8.1999999999999993,23,10,7100,16,7300,"<5",null,2017,3]
[6,"26 Långgropen uppstr Eslöv","2017-04-26",5.6,11.6,92.402286786165931,7.94,2.8,55.2,4.0999999999999996,21,9,4500,"<10",5000,"<5",null,2017,4]
[6,"26 Långgropen uppstr Eslöv","2017-05-30",14.1,7.9,77.08154570759703,7.81,4.8,62.6,45,74,25,2400,120,2800,6.6,null,2017,5]
[6,"26 Långgropen uppstr Eslöv","2017-06-27",13.1,8.5,81.137279041561314,7.87,4.5,59.9,17,80,20,1800,37,2200,"<5",null,2017,6]
[6,"26 Långgropen uppstr Eslöv","2017-07-31",14.8,8.3000000000000007,82.21157061784659,7.77,3.4,54,54,92,29,1700,34,2100,"<5",null,2017,7]
[6,"26 Långgropen uppstr Eslöv","2017-08-29",14.9,8.5,84.371909110324566,7.78,4,59.8,36,58,8,4700,400,5200,"<5",null,2017,8]
[6,"26 Långgropen uppstr Eslöv","2017-09-25",12.9,8.3000000000000007,78.876610644508645,7.61,3.5,58.2,37,63,12,5000,51,5900,"<5",null,2017,9]
[6,"26 Långgropen uppstr Eslöv","2017-10-31",6.1,10.3,83.117269431861061,7.52,27,47.2,53,100,39,5800,36,5300,13,null,2017,10]
[6,"26 Långgropen uppstr Eslöv","2017-11-21",4.3,11.3,86.977982113744872,7.68,15,50.7,32,62,28,5700,52,6000,6,null,2017,11]
[6,"26 Långgropen uppstr Eslöv","2017-12-28",5.4,10.6,83.996930891180952,7.61,19,45.1,62,99,34,4800,120,5100,13,null,2017,12]
[6,"26 Långgropen uppstr Eslöv","2018-01-30",4.3,11.9,92,7.66,49,36.799999999999997,52,100,42,4600,41,4700,28,null,2018,1]
[6,"26 Långgropen uppstr Eslöv","2018-02-28",0.1,13.1,90,7.71,7.9,61,26,50,27,4700,140,5100,"<5",null,2018,2]
[6,"26 Långgropen uppstr Eslöv","2018-03-27",1.9,12,87,7.86,12,47.5,31,64,29,4200,150,4700,12,null,2018,3]
[6,"26 Långgropen uppstr Eslöv","2018-04-25",10.199999999999999,9.4,84,7.96,9.1,61.3,12,62,39,3500,46,3800,8.4,null,2018,4]
[6,"26 Långgropen uppstr Eslöv","2018-05-29",16.399999999999999,8.1999999999999993,84,7.87,9.5,66.8,49,66,13,2500,70,3000,5.5,null,{"$f":"YEAR(C647)","v":2018},{"$f":"MONTH(C647)","v":5}]
[6,"26 Långgropen uppstr Eslöv","2018-06-18",14,8.6999999999999993,85,7.8,5.4,62.2,null,null,null,null,null,null,null,"Proverna försvunna ",2018,6]
[6,"26 Långgropen uppstr Eslöv","2018-07-16",18.3,7.7,82,7.8,3,68.099999999999994,34,56,19,930,45,1300,"<5",null,2018,7]
[6,"26 Långgropen uppstr Eslöv","2018-08-28",14.5,7,69,7.62,3.1,57.6,29,45,9,1100,"<10",1600,"<5",null,2018,8]
[6,"26 Långgropen uppstr Eslöv","2018-10-30",6.9,11.1,91,7.79,1.4,65.7,31,45,13,1900,"<10",2300,"<5",null,2018,10]
[6,"26 Långgropen uppstr Eslöv","2018-11-27",0.2,13,89,7.83,2.2999999999999998,70.2,29,40,15,1600,23,1800,"<5",null,2018,11]
[6,"26 Långgropen uppstr Eslöv","2018-12-20",4.3,11.1,85,7.8,2.2999999999999998,69.7,26,39,7,9300,38,8700,"<5",null,2018,12]
[6,"26 Långgropen uppstr Eslöv","2019-01-29",2.9,12.9,96,7.78,16,48.5,37,66,23,16000,38,16000,6.7,null,2019,1]
[6,"26 Långgropen uppstr Eslöv","2019-02-26",6.4,14.3,116,7.86,3.2,58.2,20,29,9,12000,"<10",11000,"<5",null,2019,2]
[6,"26 Långgropen uppstr Eslöv","2019-03-26",7,12,99,7.82,3.4,54.3,17,29,15,6900,14,7100,"<5",null,2019,3]
[6,"26 Långgropen uppstr Eslöv","2019-04-23",13,13.6,130,8.39,2.8,60.1,4.7,22,15,3800,"<10",4000,"<5",null,2019,4]
[6,"26 Långgropen uppstr Eslöv","2019-05-27",13.6,8.4,81,8.01,2.2000000000000002,62,34,49,24,2300,34,2600,"<5",null,2019,5]
[6,"26 Långgropen uppstr Eslöv","2019-06-24",14.5,8.6,85,7.83,2,62.1,39,59,12,1600,22,1900,"<5",null,2019,6]
[6,"26 Långgropen uppstr Eslöv","2019-07-22",15.9,6.9,70,7.7,2.1,68.099999999999994,34,47,14,970,30,1400,"<5",null,2019,7]
[6,"26 Långgropen uppstr Eslöv","2019-08-27",19.2,6.4,69,7.55,1.2,68,39,60,13,790,25,1100,"<5",null,2019,8]
[6,"26 Långgropen uppstr Eslöv","2019-09-25",7.6,10.7,90,7.72,1.6,67.099999999999994,23,32,11,1200,"<10",1500,"<5",null,2019,9]
[6,"26 Långgropen uppstr Eslöv","2019-09-26",12.1,7.3,68,7.73,1.4,68.900000000000006,43,62,11,1400,25,1900,"<5",null,2019,9]
[6,"26 Långgropen uppstr Eslöv","2019-10-21",11.3,9.1,83,7.72,6,54.2,36,59,13,10000,18,11000,"<5",null,2019,10]
[6,"26 Långgropen uppstr Eslöv","2019-11-25",7.1,11.1,93,7.9,3.5,60.3,41,60,17,9800,17,11000,"<5",null,2019,11]
[6,"26 Långgropen uppstr Eslöv","2019-12-19",6,11.1,89,7.59,8.6,50.1,33,67,23,9900,45,9800,5.5,null,2019,12]
[7,"24 Långgropen nedstr Eslöv","2010-01-26",-0.2,14.7,99.83158389610351,7.74,7.5,73.900000000000006,33,38,null,3400,260,4200,"<5",null,2010,1]
[7,"24 Långgropen nedstr Eslöv","2010-02-22",1.1000000000000001,12.8,90.222385671282112,7.78,10,76,39,58,null,2700,340,3400,6.2,null,2010,2]
[7,"24 Långgropen nedstr Eslöv","2010-03-24",2.2000000000000002,11.6,84.324000934433926,7.54,21,35.1,66,100,null,6200,78,7400,15,null,2010,3]
[7,"24 Långgropen nedstr Eslöv","2010-04-27",9.1999999999999993,6,52.319856201866301,7.8,3.1,62.4,9,13,null,3700,96,4500,"<5",null,2010,4]
[7,"24 Långgropen nedstr Eslöv","2010-05-27",11.2,9.1,83.201507449537075,7.85,2.7,59.4,8,21,null,1700,11,2400,"<5",null,2010,5]
[7,"24 Långgropen nedstr Eslöv","2010-06-23",14.1,7.52,73.373825787484762,7.83,3.7,60.6,45,68,null,1200,85,1700,"<5",null,2010,6]
[7,"24 Långgropen nedstr Eslöv","2010-07-19",15.6,7.67,77.264543694081269,7.69,3.6,67.7,69,84,null,1000,71,1200,"<5",null,2010,7]
[7,"24 Långgropen nedstr Eslöv","2010-08-25",19.100000000000001,null,null,7.77,5.7,48.9,58,91,null,7100,30,7800,"<5",null,2010,8]
[7,"24 Långgropen nedstr Eslöv","2010-09-28",10.199999999999999,8.9499999999999993,79.935192694650866,7.86,4.0999999999999996,61.4,39,54,null,5800,42,6100,"<5",null,2010,9]
[7,"24 Långgropen nedstr Eslöv","2010-10-26",6.9,9.6999999999999993,79.894619770206006,7.55,43,42.1,74,120,null,10000,14,11000,9.8000000000000007,null,2010,10]
[7,"24 Långgropen nedstr Eslöv","2010-11-23",4.9000000000000004,10.1,78.990061967148378,7.55,44,41.9,54,120,null,6300,32,7200,18,null,2010,11]
[7,"24 Långgropen nedstr Eslöv","2010-12-21",0.1,12.1,82.888695139706627,7.74,10,66.3,29,42,null,5000,110,5400,5.5,null,2010,12]
[7,"24 Långgropen nedstr Eslöv","2011-01-27",1.6,12.3,87.928019153844645,7.65,13,49.1,39,56,null,5700,66,6300,"<5",null,2011,1]
[7,"24 Långgropen nedstr Eslöv","2011-02-24",0.4,14,96.733835983756848,7.86,10,66.3,30,53,null,3800,500,5100,11,null,2011,2]
[7,"24 Långgropen nedstr Eslöv","2011-03-29",3.3,11.3,84.664436346776142,7.86,3,57,13,25,null,4900,77,5900,"<5",null,2011,3]
[7,"24 Långgropen nedstr Eslöv","2011-04-27",10.7,9.3000000000000007,84.045309364813932,7.85,2.8,63.1,11,27,null,2900,44,3700,"<5",null,2011,4]
[7,"24 Långgropen nedstr Eslöv","2011-05-24",12.8,6.9,65.425971294586546,7.66,3.9,59.4,38,61,null,2000,130,2800,"<5",null,2011,5]
[7,"24 Långgropen nedstr Eslöv","2011-06-28",14.4,7.8,76.60032748593494,7.67,4.7,65.5,51,67,null,1400,61,1800,"<5",null,2011,6]
[7,"24 Långgropen nedstr Eslöv","2011-07-27",14.6,7.8,76.929787020427426,7.81,4.5,52.1,55,83,null,2600,54,3500,"<5",null,2011,7]
[7,"24 Långgropen nedstr Eslöv","2011-08-30",13.8,8.1999999999999993,79.488490555867372,7.77,10,51.4,46,67,null,4600,42,5400,5.0999999999999996,null,2011,8]
[7,"24 Långgropen nedstr Eslöv","2011-09-27",12,8.1,75.431465639358436,7.88,3.3,64,47,58,null,3100,45,4200,7.9,null,2011,9]
[7,"24 Långgropen nedstr Eslöv","2011-10-26",8.4,9.6,82.092823133561609,7.81,3.5,62.2,35,47,null,4300,51,4900,"<5",null,2011,10]
[7,"24 Långgropen nedstr Eslöv","2011-11-29",5.9,11.1,89.111124879251733,7.91,10,55.6,42,68,null,5100,44,5400,"<5",null,2011,11]
[7,"24 Långgropen nedstr Eslöv","2011-12-22",4.3,11.3,86.977982113744872,7.79,5.8,56.9,23,38,null,6400,53,7700,"<5",null,2011,12]
[7,"24 Långgropen nedstr Eslöv","2012-01-27",1.8,12.7,91.297340956733862,7.68,13,59.6,24,48,null,5600,110,6300,13,null,2012,1]
[7,"24 Långgropen nedstr Eslöv","2012-02-28",2.9,13.2,97.825572596339157,7.5,14,49.4,30,59,null,3900,120,4900,10,null,2012,2]
[7,"24 Långgropen nedstr Eslöv","2012-03-29",6.3,10.8,87.602004042337583,7.92,4.4000000000000004,62.6,24,43,24,3700,120,4500,"<5",null,2012,3]
[7,"24 Långgropen nedstr Eslöv","2012-04-25",9.1,8.9,77.419966204162776,7.8,6.2,60.5,19,41,null,2400,62,3000,"<5",null,2012,4]
[7,"24 Långgropen nedstr Eslöv","2012-05-29",13.5,8,77.041941761365791,7.81,5,69.7,44,79,null,2000,110,2300,"<5",null,2012,5]
[7,"24 Långgropen nedstr Eslöv","2012-06-26",12.9,8.5,80.777251864858243,7.81,12,39.9,81,110,null,2700,81,3200,"<5",null,2012,6]
[7,"24 Långgropen nedstr Eslöv","2012-07-25",15.3,7.3,73.076170673361347,7.73,2.6,67.2,53,67,null,1100,42,1500,"<5",null,2012,7]
[7,"24 Långgropen nedstr Eslöv","2012-08-27",15.3,7.2,72.075127239479684,7.61,11,61.8,35,85,null,1100,38,1700,7.8,null,2012,8]
[7,"24 Långgropen nedstr Eslöv","2012-09-24",10.9,8.1,73.543791049462996,7.62,2.5,56.8,29,63,null,1100,24,1400,"<5",null,2012,9]
[7,"24 Långgropen nedstr Eslöv","2012-10-30",6.8,9.9,81.334966632848321,7.66,24,35.9,32,150,null,1400,220,2400,30,null,2012,10]
[7,"24 Långgropen nedstr Eslöv","2012-11-25",4.5,11.9,92.085942577217466,7.36,59,27,100,200,null,6800,33,7100,37,null,2012,11]
[7,"24 Långgropen nedstr Eslöv","2012-11-28",6.7,11.6,95.059201938886133,7.69,13,50.8,35,49,null,7400,26,7800,"<5",null,2012,11]
[7,"24 Långgropen nedstr Eslöv","2012-12-20",3.1,12.6,93.891309146374013,7.63,9.3000000000000007,50,28,53,null,7500,15,8400,"<5",null,2012,12]
[7,"24 Långgropen nedstr Eslöv","2013-01-30",2.2000000000000002,12.6,91.59331135981617,7.61,96,36.9,29,200,null,3000,28,3100,91,null,2013,1]
[7,"24 Långgropen nedstr Eslöv","2013-02-26",2.4,11.9,86.985470957550632,7.83,5.8,61.9,13,36,null,4300,100,4800,5.3,null,2013,2]
[7,"24 Långgropen nedstr Eslöv","2013-03-26",0.1,13.5,92.479122676532185,7.88,9.3000000000000007,66.5,15,33,null,3800,100,4300,8.5,null,2013,3]
[7,"24 Långgropen nedstr Eslöv","2013-04-25",8.5,10.1,86.581147910561313,7.83,2.9,60.8,7,18,null,2200,45,2600,"<5",null,2013,4]
[7,"24 Långgropen nedstr Eslöv","2013-05-29",12.4,7.1,66.720712563255162,7.77,3.2,64.599999999999994,36,60,null,1200,110,1800,"<5",null,2013,5]
[7,"24 Långgropen nedstr Eslöv","2013-06-26",14.2,7.4,72.359383279260769,7.71,4.2,49.8,20,51,null,770,130,1300,"<5",null,2013,6]
[7,"24 Långgropen nedstr Eslöv","2013-07-25",14.3,7,68.595992388089854,7.63,2.4,75.599999999999994,36,59,null,640,43,1100,"<5",null,2013,7]
[7,"24 Långgropen nedstr Eslöv","2013-08-27",13.1,7.7,73.500829249414366,7.61,8.9,73.599999999999994,33,88,null,700,18,1200,"<5",null,{"$f":"YEAR(C711)","v":2013},{"$f":"MONTH(C711)","v":8}]
[7,"24 Långgropen nedstr Eslöv","2013-09-26",8.8000000000000007,9,77.720406310746725,7.68,1.9,64.2,34,49,null,810,44,1200,"<5",null,2013,9]
[7,"24 Långgropen nedstr Eslöv","2013-10-29",10.4,8.5,76.275819569799935,7.75,26,47.5,120,110,null,8800,"<10",8800,17,null,2013,10]
[7,"24 Långgropen nedstr Eslöv","2013-11-27",4.3,11.7,90.056848737240244,7.75,2.9,63.6,16,50,null,6100,22,7200,13,null,2013,11]
[7,"24 Långgropen nedstr Eslöv","2013-12-23",5,11.5,90.176756954106295,7.72,6.7,47.9,28,47,null,8400,22,9100,"<5",null,2013,12]
[7,"24 Långgropen nedstr Eslöv","2014-01-28",0.7,13.4,93.3849054412415,7.84,14,62.1,27,56,null,5500,130,6600,11,null,2014,1]
[7,"24 Långgropen nedstr Eslöv","2014-02-27",4.0999999999999996,12,91.872999659862202,7.79,6.8,54.2,19,44,null,6000,50,6700,"<5",null,2014,2]
[7,"24 Långgropen nedstr Eslöv","2014-03-27",3.5,12.6,94.918787621417849,7.81,8.6,49.5,14,42,null,4700,75,5400,5.9,null,2014,3]
[7,"24 Långgropen nedstr Eslöv","2014-04-29",9.9,8.5,75.376783385192496,7.73,4,63.3,12,33,null,3200,66,4200,"<5",null,2014,4]
[7,"24 Långgropen nedstr Eslöv","2014-05-28",11.6,8.5,78.436031220280526,7.82,5,63.4,32,63,null,3100,74,4300,5.8,null,2014,5]
[7,"24 Långgropen nedstr Eslöv","2014-06-24",11.9,7.5,69.685024826794191,7.65,5.2,57.6,22,54,null,1500,83,2300,5.8,null,2014,6]
[7,"24 Långgropen nedstr Eslöv","2014-07-21",16.600000000000001,7.4,76.098806202631778,7.72,3.9,68.2,51,77,null,1200,83,1500,"<5",null,2014,7]
[7,"24 Långgropen nedstr Eslöv","2014-08-28",13.9,9,87.433822151478594,7.79,3.1,58.3,39,69,null,3400,33,4400,"<5",null,2014,8]
[7,"24 Långgropen nedstr Eslöv","2014-09-30",11.7,8.6999999999999993,80.465928528427185,7.88,3.5,66.3,42,58,null,1700,36,2100,"<5",null,2014,9]
[7,"24 Långgropen nedstr Eslöv","2014-10-29",9.8000000000000007,9.5,84.043799618685696,7.75,4.4000000000000004,59.9,35,61,null,6000,70,7100,"<5",null,2014,10]
[7,"24 Långgropen nedstr Eslöv","2014-11-27",6.8,11.2,92.015315786656686,7.93,9,59.1,26,48,null,6300,49,6800,7.4,null,2014,11]
[7,"24 Långgropen nedstr Eslöv","2014-12-22",6.7,10.8,88.503394908618134,7.44,234,21.5,110,320,null,4500,24,5700,140,"översvämn",2014,12]
[7,"24 Långgropen nedstr Eslöv","2015-01-27",3.9,11.9,90.619288842970519,7.61,57,36.299999999999997,62,120,null,5800,50,6800,27,null,2015,1]
[7,"24 Långgropen nedstr Eslöv","2015-02-24",3.9,12.5,95.18832861656567,7.81,22,47.3,39,69,null,5800,99,6200,15,null,2015,2]
[7,"24 Långgropen nedstr Eslöv","2015-03-31",5,10.8,84.687736965595491,7.61,67,36.700000000000003,91,170,null,11000,330,12000,35,null,2015,3]
[7,"24 Långgropen nedstr Eslöv","2015-04-29",7.6,10.8,90.538471783069269,7.9,5.2,58,3.5,27,null,3400,52,3800,"<5",null,2015,4]
[7,"24 Långgropen nedstr Eslöv","2015-05-27",11,9.1999999999999993,83.726064155337156,7.9,5.3,61.8,15,44,null,1700,59,3100,"<5",null,2015,5]
[7,"24 Långgropen nedstr Eslöv","2015-06-25",12.1,10,93.337165128454131,7.79,5.0999999999999996,59.8,29,56,null,1800,84,2600,"<5",null,2015,6]
[7,"24 Långgropen nedstr Eslöv","2015-07-28",14.9,7.5,74.445802156168725,7.73,8.6,42.9,24,76,null,1300,320,1800,"<5",null,2015,7]
[7,"24 Långgropen nedstr Eslöv","2015-08-26",15.6,7.3,73.537310165162097,7.53,4.4000000000000004,51.7,22,61,null,1200,200,1900,"<5",null,2015,8]
[7,"24 Långgropen nedstr Eslöv","2015-09-30",11.4,10,91.853931261569301,7.7,2.8,67,9.5,45,null,1900,27,2100,"<5",null,2015,9]
[7,"24 Långgropen nedstr Eslöv","2015-10-28",6.9,9.1999999999999993,75.776340400607765,7.73,2.8,66.099999999999994,25,56,null,1700,24,2100,"<5",null,2015,10]
[7,"24 Långgropen nedstr Eslöv","2015-12-21",7.6,10.5,88.023514233539572,7.75,11,53.1,27,56,null,6600,54,6800,6.5,null,2015,12]
[7,"24 Långgropen nedstr Eslöv","2016-01-27",4.0999999999999996,11.9,91.107391329363352,7.61,37,41.3,60,120,null,5100,130,5700,39,null,2016,1]
[7,"24 Långgropen nedstr Eslöv","2016-02-25",2.7,11.3,83.285978240397853,7.74,13,49.5,25,56,null,5900,21,6000,10,null,2016,2]
[7,"24 Långgropen nedstr Eslöv","2016-03-30",6.3,10.199999999999999,82.735226039985477,7.86,5.2,57.9,7.6,38,null,3700,58,3800,"<5",null,2016,3]
[7,"24 Långgropen nedstr Eslöv","2016-04-27",4.7,10.5,81.68501855944514,7.79,14,37.700000000000003,25,61,null,3100,140,3800,14,null,2016,4]
[7,"24 Långgropen nedstr Eslöv","2016-05-31",16.899999999999999,6.5,67.25187045134399,7.71,4.9000000000000004,58,32,72,null,1400,140,2300,"<5",null,2016,5]
[7,"24 Långgropen nedstr Eslöv","2016-06-28",16.100000000000001,6.7,68.197462236074784,7.68,4.5999999999999996,58.4,23,85,null,1100,81,1400,6.2,null,2016,6]
[7,"24 Långgropen nedstr Eslöv","2016-07-26",17.8,7.2,75.8469600573154,7.84,3.1,61.5,35,65,null,1600,33,1900,"<5",null,2016,7]
[7,"24 Långgropen nedstr Eslöv","2016-08-30",14.3,7.4,72.515763381694981,7.66,3.2,52.3,42,75,null,1300,34,1600,5.5,null,2016,8]
[7,"24 Långgropen nedstr Eslöv","2016-09-27",11.1,8.1999999999999993,74.799088222984977,7.8,3.2,72.099999999999994,22,52,null,1000,20,1400,"<5",null,2016,9]
[7,"24 Långgropen nedstr Eslöv","2016-10-26",7.5,9.4,78.60481333100266,7.74,2.2999999999999998,61.4,13,59,null,1600,46,2100,"<5",null,2016,10]
[7,"24 Långgropen nedstr Eslöv","2016-11-29",2.2999999999999998,12.6,91.847661872413383,7.88,3,66.400000000000006,5.9,42,null,6000,68,6500,"<5",null,2016,11]
[7,"24 Långgropen nedstr Eslöv","2016-12-28",3.1,12.4,null,7.86,9.6,55.9,27,48,null,11000,36,11000,5.8,null,2016,12]
[7,"24 Långgropen nedstr Eslöv","2017-01-31",3.2,12.8,95.642245945886245,7.84,2.5,62.6,20,36,null,7200,53,6900,"<5",null,2017,1]
[7,"24 Långgropen nedstr Eslöv","2017-02-28",4.7,11.1,86.352733905699154,7.61,28,39.700000000000003,38,110,null,10000,32,11000,12,null,2017,2]
[7,"24 Långgropen nedstr Eslöv","2017-03-28",5.8,10.9,87.278963730956676,7.86,4.3,58.3,11,28,null,6300,45,7000,"<5",null,2017,3]
[7,"24 Långgropen nedstr Eslöv","2017-04-26",5.9,11.3,90.716730732931964,7.88,4.2,56.4,7.4,28,null,4300,44,4800,"<5",null,2017,4]
[7,"24 Långgropen nedstr Eslöv","2017-05-30",14.2,7.6,74.31504228680835,7.77,4.5,66.5,34,83,null,2100,120,2600,"<5",null,2017,5]
[7,"24 Långgropen nedstr Eslöv","2017-06-27",12.8,7.8,73.9597936373587,7.79,3.9,60.3,46,72,null,1600,86,2000,"<5",null,2017,6]
[7,"24 Långgropen nedstr Eslöv","2017-07-31",14.8,7.5,74.287563811307152,7.84,4.8,56.8,31,86,null,1500,56,2000,"<5",null,2017,7]
[7,"24 Långgropen nedstr Eslöv","2017-08-29",14.7,8.5,84.013182758490018,7.79,3.2,60.9,38,110,null,4500,49,4600,6,null,2017,8]
[7,"24 Långgropen nedstr Eslöv","2017-09-25",12.9,8.4,79.826931254683444,7.67,3.2,59.9,37,64,null,4900,72,5700,"<5",null,2017,9]
[7,"24 Långgropen nedstr Eslöv","2017-10-31",5.6,10.3,82.046858094612858,7.58,26,47.9,54,100,null,5600,45,5300,12,null,2017,10]
[7,"24 Långgropen nedstr Eslöv","2017-11-21",4.4000000000000004,11.2,86.438604464343499,7.69,14,52.2,32,66,null,5600,78,5800,"<5",null,2017,11]
[7,"24 Långgropen nedstr Eslöv","2017-12-28",5.3,10.6,83.777331657091395,7.63,19,46.9,59,92,null,4700,120,5000,10,null,2017,12]
[7,"24 Långgropen nedstr Eslöv","2018-01-30",4.3,11.9,92,7.66,49,37.700000000000003,53,130,null,4500,49,4800,25,null,2018,1]
[7,"24 Långgropen nedstr Eslöv","2018-02-28",0.1,13.1,90,7.74,10,65.3,28,58,null,4500,230,4900,8.8000000000000007,null,2018,2]
[7,"24 Långgropen nedstr Eslöv","2018-03-27",2,12.3,89,7.8449999999999998,11.5,52.4,33,58,null,4100,170,4700,12,null,2018,3]
[7,"24 Långgropen nedstr Eslöv","2018-04-25",8.6,9.5,82,7.87,7,66.099999999999994,9.6,55,null,3400,100,3600,5.5,null,2018,4]
[7,"24 Långgropen nedstr Eslöv","2018-05-29",15.7,7.8,79,7.79,7.6,75.8,40,72,null,2200,75,2500,8.6999999999999993,null,2018,5]
[7,"24 Långgropen nedstr Eslöv","2018-06-18",14.4,6.9,68,7.66,4.5999999999999996,65.3,null,null,null,null,null,null,null,"Proverna försvunna ",2018,6]
[7,"24 Långgropen nedstr Eslöv","2018-07-16",16.600000000000001,7.8,80,7.73,3.7,78.099999999999994,5.6,64,null,920,39,1200,"<5",null,2018,7]
[7,"24 Långgropen nedstr Eslöv","2018-08-28",13.4,8.1999999999999993,79,7.56,6.4,35.9,13,63,null,890,66,1400,"<5",null,2018,8]
[7,"24 Långgropen nedstr Eslöv","2018-10-30",7.2,9.9,82,7.72,2.2999999999999998,59.6,14,45,null,1200,52,1500,"<5",null,2018,10]
[7,"24 Långgropen nedstr Eslöv","2018-11-27",0.5,11.2,78,7.69,10,72.3,30,88,null,1200,54,1600,13,null,2018,11]
[7,"24 Långgropen nedstr Eslöv","2018-12-20",4.4000000000000004,11.2,86,7.76,2.5,70.900000000000006,25,44,null,7900,95,7600,"<5",null,2018,12]
[7,"24 Långgropen nedstr Eslöv","2019-01-29",2.9,12.9,96,7.76,18,49.8,31,79,null,15000,36,16000,9.6999999999999993,null,2019,1]
[7,"24 Långgropen nedstr Eslöv","2019-02-26",6.1,14,113,7.86,3.5,60.1,21,31,null,12000,26,12000,"<5","BOD ändrat 15/4",{"$f":"YEAR(C775)","v":2019},{"$f":"MONTH(C775)","v":2}]
[7,"24 Långgropen nedstr Eslöv","2019-03-26",6.7,11.6,95,7.82,3.7,56.4,17,32,null,6700,30,6800,"<5",null,2019,3]
[7,"24 Långgropen nedstr Eslöv","2019-04-23",11.2,11.6,106,8.0299999999999994,3.2,66.7,5.4,28,null,3500,32,3600,"<5",null,2019,4]
[7,"24 Långgropen nedstr Eslöv","2019-05-27",13.1,7.1,68,7.84,3.7,60.2,11,59,null,1700,230,2400,"<5",null,2019,5]
[7,"24 Långgropen nedstr Eslöv","2019-06-24",14.7,7.2,71,7.69,2.2999999999999998,65.5,41,64,null,1300,38,1600,"<5",null,2019,6]
[7,"24 Långgropen nedstr Eslöv","2019-07-22",15,6.8,68,7.68,3.3,72.400000000000006,43,57,null,1000,37,1400,"<5",null,2019,7]
[7,"24 Långgropen nedstr Eslöv","2019-08-27",17.7,6.5,68,7.57,2.5,71.5,45,68,null,860,20,1100,"<5",null,2019,8]
[7,"24 Långgropen nedstr Eslöv","2019-09-25",9,8.8000000000000007,76,7.59,2.7,52.1,9.8000000000000007,46,null,820,61,1200,"<5",null,2019,9]
[7,"24 Långgropen nedstr Eslöv","2019-09-26",12.2,7.1,66,7.73,2.2999999999999998,70.349999999999994,40,60,null,1200,18,1400,"<5",null,2019,9]
[7,"24 Långgropen nedstr Eslöv","2019-10-21",11.3,8.9,82,7.7,7,53.6,37,63,null,9700,22,11000,"<5",null,2019,10]
[7,"24 Långgropen nedstr Eslöv","2019-11-25",7.2,10.8,90,7.87,2.8,61.4,32,47,16,8300,30,9100,"<5",null,2019,11]
[7,"24 Långgropen nedstr Eslöv","2019-12-19",6,11.1,89,7.62,8.3000000000000007,50.8,32,63,null,9400,49,10000,5.7,null,2019,12]
[8,"19 Saxån vid Annelöv","2010-02-22",0.1,13.8,94.534214291566229,7.99,7.3,74.8,52,65,null,3200,180,3700,"<5",null,2010,2]
[8,"19 Saxån vid Annelöv","2010-03-24",3.8,12.8,97.210663702494244,7.82,25,34.799999999999997,69,110,null,5600,52,6700,12,null,2010,3]
[8,"19 Saxån vid Annelöv","2010-05-27",12.7,10.3,97.446669543925481,8.15,4.4000000000000004,58.6,39,60,null,2000,14,2700,5.4,null,2010,5]
[8,"19 Saxån vid Annelöv","2010-08-25",20.100000000000001,6.7,73.763135992440482,8.01,4.5999999999999996,46.7,100,150,null,3500,24,4300,10,null,2010,8]
[8,"19 Saxån vid Annelöv","2010-10-26",7.5,10.7,89.475691770396622,7.9,29,50.3,74,110,null,10000,13,11000,9.1999999999999993,null,2010,10]
[8,"19 Saxån vid Annelöv","2010-12-21",0.2,13.2,90.684440334561373,7.9649999999999999,4.3,64,47,52,null,5600,64,6300,"<5","delvis is",2010,12]
[8,"19 Saxån vid Annelöv","2011-02-24",0.2,13.7,94.119457013900828,8.02,5.0999999999999996,63.4,53,69,null,4700,140,5600,"<5","taget i \"fönster\", i övrigt istäckt",2011,2]
[8,"19 Saxån vid Annelöv","2011-03-29",5,13,101.93894264377232,8.25,2.6,54.7,18,26,null,4600,11,5800,"<5",null,2011,3]
[8,"19 Saxån vid Annelöv","2011-05-24",14,8.1,78.861726699886049,7.95,4.8,59.1,100,100,null,1700,170,2300,"<5",null,2011,5]
[8,"19 Saxån vid Annelöv","2011-08-30",14.3,9.1,89.174790104516802,7.98,12.5,54.5,81,110,null,4800,23,5800,8,null,2011,8]
[8,"19 Saxån vid Annelöv","2011-10-26",8.3000000000000007,10.5,89.56802779599991,8.08,3.3,62.3,20,65,null,4400,21,4900,"<5",null,2011,10]
[8,"19 Saxån vid Annelöv","2011-12-22",4.0999999999999996,12.2,93.404216320859888,8.11,8.3000000000000007,58.9,45,58,null,6000,33,6900,5.9,null,2011,12]
[8,"19 Saxån vid Annelöv","2012-02-28",3.4,12.7,95.412859812906305,7.9,17,48.5,50,80,null,4300,82,5300,10,null,2012,2]
[8,"19 Saxån vid Annelöv","2012-03-29",7.7,10.9,91.605550433255445,8.1999999999999993,4.0999999999999996,58.3,23,43,17,3400,16,4000,"<5",null,2012,3]
[8,"19 Saxån vid Annelöv","2012-05-29",15.6,6.3,63.46370603294811,7.94,3,62.5,100,150,null,1600,130,2000,"<5",null,2012,5]
[8,"19 Saxån vid Annelöv","2012-08-27",16.8,8.4,86.734303243263938,7.96,1.5,60.6,100,140,null,960,30,1300,"<5",null,2012,8]
[8,"19 Saxån vid Annelöv","2012-10-30",5,11.1,87.040174103528685,7.96,10,62.5,46,81,null,2700,"<10",3300,7.1,null,2012,10]
[8,"19 Saxån vid Annelöv","2012-12-20",2.7,12.7,93.604595013544483,7.92,15,50.8,44,69,null,7800,17,7100,8.4,null,2012,12]
[8,"19 Saxån vid Annelöv","2013-02-26",2,13.8,99.760169689720158,8.1300000000000008,6.1,59.9,27,46,null,4900,27,5100,"<5",null,2013,2]
[8,"19 Saxån vid Annelöv","2013-03-26",0.4,14.8,102.26148375425723,8.16,4.8,60.7,14,24,null,3800,12,4100,"<5","is",2013,3]
[8,"19 Saxån vid Annelöv","2013-05-29",14.2,7.7,75.292871790582154,7.93,3.6,60.3,110,140,null,1400,130,2000,"<5",null,2013,5]
[8,"19 Saxån vid Annelöv","2013-08-27",15.5,7.8,78.409930385501539,7.84,2.1,68.900000000000006,86,120,null,660,25,1400,"<5",null,2013,8]
[8,"19 Saxån vid Annelöv","2013-10-29",10.7,8.6999999999999993,78.623031341277539,7.97,4.7,57.1,64,95,null,4000,46,4800,"<5",null,2013,10]
[8,"19 Saxån vid Annelöv","2013-12-23",5.3,12,94.84226225331102,7.99,15,50,37,64,null,8500,"<10",9100,11,null,2013,12]
[8,"19 Saxån vid Annelöv","2014-02-27",4.4000000000000004,12.7,98.015203276532361,8.07,12,54.3,36,74,null,6000,31,5900,9,null,2014,2]
[8,"19 Saxån vid Annelöv","2014-03-27",4.3,13.1,100.83288191947413,8.16,6.9,49.3,13,33,null,3300,"<10",4100,"<5",null,2014,3]
[8,"19 Saxån vid Annelöv","2014-05-28",13.9,8.6999999999999993,84.519361413095979,7.98,3.5,59.1,78,120,null,3200,89,4200,"<5",null,2014,5]
[8,"19 Saxån vid Annelöv","2014-08-28",15.3,8.5,85.088691879941294,7.88,2.1,50.4,57,87,null,3100,19,4200,"<5",null,2014,8]
[8,"19 Saxån vid Annelöv","2014-10-29",10.3,10.199999999999999,91.31513604293508,8.01,4.5999999999999996,59.7,60,76,null,5400,24,6400,"<5",null,2014,10]
[8,"19 Saxån vid Annelöv","2014-12-22",6.9,11.2,92.249457879000758,6.99,76,47.7,98,180,null,7000,23,7800,32,null,2014,12]
[8,"19 Saxån vid Annelöv","2015-02-24",3.4,13,97.666706895100944,7.95,21,50.7,45,72,null,5800,41,6200,18,null,2015,2]
[8,"19 Saxån vid Annelöv","2015-03-31",4.5999999999999996,10.9,84.572143482331228,7.7,74,38.700000000000003,140,200,null,12000,380,13000,40,null,2015,3]
[8,"19 Saxån vid Annelöv","2015-05-27",11.7,9.9,91.564677290968874,8.18,3.8,58.8,31,56,null,590,21,3400,"<5",null,2015,5]
[8,"19 Saxån vid Annelöv","2015-08-26",16.3,7.4,75.633275238178825,7.86,1.7,63.3,100,120,null,1000,36,1500,"<5",null,2015,8]
[8,"19 Saxån vid Annelöv","2015-10-28",7.6,9.6,80.478641584950466,7.94,3.8,65.400000000000006,71,93,null,1800,12,2200,"<5",null,2015,10]
[8,"19 Saxån vid Annelöv","2015-12-21",7.8,11.2,94.361963291437377,8.0500000000000007,10.4,55.5,46,71,null,6400,28,6500,6.9,null,2015,12]
[8,"19 Saxån vid Annelöv","2016-02-25",3.1,12.1,90.165463545327427,8.0500000000000007,12,49.4,37,68,null,5800,"<10",5900,12,null,2016,2]
[8,"19 Saxån vid Annelöv","2016-03-30",7.2,10.9,90.462807164142518,8.17,4.2,55,8.4,33,null,3500,"<10",3900,"<5",null,2016,3]
[8,"19 Saxån vid Annelöv","2016-05-31",18.7,7.4,79.336458139427421,8.02,3.8,60.5,97,120,null,1400,100,2100,"<5",null,2016,5]
[8,"19 Saxån vid Annelöv","2016-08-30",15.8,8.1,81.936992138145854,7.92,2.6,54.9,97,120,null,1200,19,1400,"<5",null,2016,8]
[8,"19 Saxån vid Annelöv","2016-10-26",7.3,9.6999999999999993,80.706794678492813,7.86,2.4,52.2,43,82,null,1400,15,1700,"<5",null,2016,10]
[8,"19 Saxån vid Annelöv","2016-12-28",3.3,12.8,null,8.09,16,55.6,38,77,null,11000,23,11000,5.8,null,2016,12]
[8,"19 Saxån vid Annelöv","2017-02-28",5,11.6,90.960902666750684,7.82,34,42.4,50,120,null,11000,18,11000,19,"översvämn. nedströms",2017,2]
[8,"19 Saxån vid Annelöv","2017-03-28",6.3,11.7,94.902171045865686,8.11,5.3,59.4,16,36,null,7200,15,7400,"<5",null,2017,3]
[8,"19 Saxån vid Annelöv","2017-05-30",15.9,7.4,75.011599015602485,7.87,3.3,59.5,90,120,null,1700,150,2100,"<5",null,2017,5]
[8,"19 Saxån vid Annelöv","2017-08-29",15,8.8000000000000007,87.535350987449348,8,4,59.2,68,88,null,3900,31,4400,"<5",null,2017,8]
[8,"19 Saxån vid Annelöv","2017-10-31",7,11.3,93.309469890773187,7.93,36,48,70,130,null,6300,23,5800,15,null,2017,10]
[8,"19 Saxån vid Annelöv","2017-12-28",5.3,11.5,90.890501326089719,7.96,23,49.6,58,85,null,5700,40,5800,20,null,2017,12]
[8,"19 Saxån vid Annelöv","2018-02-28",0.1,13.9,95,8.0399999999999991,6.9,64.7,40,62,null,5100,96,5500,"<5",null,2018,2]
[8,"19 Saxån vid Annelöv","2018-03-27",3.5,11.9,90,8.1,13,53.9,41,62,null,4300,93,4700,9.6999999999999993,null,2018,3]
[8,"19 Saxån vid Annelöv","2018-05-29",17.8,7.7,81,7.96,5.4,67.8,110,130,null,1900,99,2300,"<5",null,2018,5]
[8,"19 Saxån vid Annelöv","2018-08-28",14.9,7.6,75,7.78,2.9,64.599999999999994,91,110,null,950,31,1300,"<5",null,2018,8]
[8,"19 Saxån vid Annelöv","2018-10-30",6.7,11.3,93,7.88,2.6,54.8,51,65,null,1200,"<10",1200,"<5",null,{"$f":"YEAR(C839)","v":2018},{"$f":"MONTH(C839)","v":10}]
[8,"19 Saxån vid Annelöv","2018-12-20",3.5,13.5,102,7.89,3.1,71.400000000000006,44,59,null,8500,37,7800,"<5",null,2018,12]
[8,"19 Saxån vid Annelöv","2019-02-26",5.5,12.9,102,8.1,6.3,61.3,29,42,null,14000,12,14000,5.2,null,2019,2]
[8,"19 Saxån vid Annelöv","2019-03-26",6.2,12.3,100,8.0399999999999991,8.1999999999999993,57.5,31,54,null,7700,14,8100,8.6999999999999993,null,2019,3]
[8,"19 Saxån vid Annelöv","2019-05-27",13.6,8,77,8.1,2.6,60.5,64,90,null,1900,70,2300,"<5",null,2019,5]
[8,"19 Saxån vid Annelöv","2019-08-27",19.3,7.1,77,7.72,3.2,55,98,130,null,1200,38,1700,"<5",null,2019,8]
[8,"19 Saxån vid Annelöv","2019-10-21",11.3,9.6,88,7.92,4.8,60.1,54,77,null,8600,12,9100,"<5",null,2019,10]
[8,"19 Saxån vid Annelöv","2019-12-19",5.5,12.2,97,7.93,14.4,53.6,44,90,null,10000,32,11000,9.8000000000000007,null,2019,12]
[9,"30 Välabäcken","2010-01-26",-0.1,14.2,96.715073207892459,7.78,17,81.5,50,140,100,7400,190,8400,27,null,2010,1]
[9,"30 Välabäcken","2010-02-22",0.6,13.3,92.424078670161364,7.93,6.5,76.8,62,73,34,6400,170,6500,"<5",null,2010,2]
[9,"30 Välabäcken","2010-03-24",4.0999999999999996,12.4,94.935432981857602,7.81,6.5,61.3,38,53,25,10000,"<10",11000,"<5",null,2010,3]
[9,"30 Välabäcken","2010-04-27",8.5,7.1,60.863975263859928,8,2,70.099999999999994,24,35,10,6400,20,7200,"<5",null,2010,4]
[9,"30 Välabäcken","2010-05-27",12.1,13,121.33831466699037,8.1750000000000007,2.4,68.900000000000006,25,38,12,5600,13,7000,"<5",null,2010,5]
[9,"30 Välabäcken","2010-06-23",14.8,9.4700000000000006,93.800430572410505,8.0500000000000007,2.8,71.400000000000006,81,92,18,5000,32,6200,"<5",null,2010,6]
[9,"30 Välabäcken","2010-07-19",15.7,9.98,100.74455867828935,8.02,2,73.099999999999994,160,170,20,6600,14,6300,"<5",null,2010,7]
[9,"30 Välabäcken","2010-08-25",19.7,5.0999999999999996,55.729618681196577,7.86,2.2999999999999998,66,90,130,34,11000,20,11000,"<5",null,2010,8]
[9,"30 Välabäcken","2010-09-28",11.7,10.38,96.004176795985558,8.08,2.6,75.599999999999994,90,110,18,9100,13,9800,"<5",null,2010,9]
[9,"30 Välabäcken","2010-10-26",8.1,10,84.882177266290839,7.8,14,72.900000000000006,51,94,34,14000,"<10",14000,14,null,2010,10]
[9,"30 Välabäcken","2010-11-23",5.6,10.8,86.029715283671734,7.66,48,63.8,55,130,65,11000,"<10",12000,26,null,2010,11]
[9,"30 Välabäcken","2010-12-21",0.4,14.4,99.497659869007038,7.93,7.5,75.8,58,77,36,9600,70,10000,"<5",null,2010,12]
[9,"30 Välabäcken","2011-01-27",1.7,12.9,92.476007232575753,7.74,12,61.2,55,73,31,8900,"<10",9700,"<5",null,2011,1]
[9,"30 Välabäcken","2011-02-24",0.5,13.9,96.318072935222446,8.02,6.6,72.8,80,100,28,8000,120,9300,"<5",null,2011,2]
[9,"30 Välabäcken","2011-03-29",4.5999999999999996,15.9,123.36670471275839,8.24,1.7,69.400000000000006,19,31,15,7800,14,10000,"<5",null,2011,3]
[9,"30 Välabäcken","2011-04-27",11.7,13.6,125.78581930880573,8.1199999999999992,3.2,70.2,36,53,25,6300,25,7200,"<5",null,2011,4]
[9,"30 Välabäcken","2011-05-24",12,9.4,87.537750248144377,7.94,2.8,70,100,120,24,4700,83,5700,"<5",null,2011,5]
[9,"30 Välabäcken","2011-06-28",15,12.5,124.33998719808143,8.08,1.5,72.400000000000006,95,110,25,5200,15,5800,"<5",null,2011,6]
[9,"30 Välabäcken","2011-07-27",14.4,10,98.205548058890955,8.06,1.1000000000000001,74.7,110,130,10,6700,72,7400,"<5",null,2011,7]
[9,"30 Välabäcken","2011-08-30",14.2,8.9,87.026825835867683,7.87,4.8,74.3,61,67,"<5",6700,26,7500,"<5",null,2011,8]
[9,"30 Välabäcken","2011-09-27",12.4,9.1,85.515279482481958,8.02,1.9,76.3,90,91,16,5700,43,6600,"<5",null,2011,9]
[9,"30 Välabäcken","2011-10-26",8.9,10.1,87.432515723830221,7.97,4.5,77.099999999999994,57,82,23,6900,25,7400,"<5",null,2011,10]
[9,"30 Välabäcken","2011-11-29",5.9,11.4,91.519533659772051,8.01,4.3,77,86,100,29,6600,85,6400,"<5",null,2011,11]
[9,"30 Välabäcken","2011-12-22",5.3,11.5,90.890501326089719,7.98,5,75.5,45,63,17,9000,50,10000,"<5",null,2011,12]
[9,"30 Välabäcken","2012-01-27",3.1,12.6,93.891309146374013,7.85,8.5,73.3,45,70,27,9600,49,10000,9.8000000000000007,null,2012,1]
[9,"30 Välabäcken","2012-02-28",3.6,11.9,89.888653047116833,7.78,11,62.2,47,75,21,6800,68,8200,6.6,null,2012,2]
[9,"30 Välabäcken","2012-03-29",6.5,12.4,101.09725224108665,8.1199999999999992,2.1,72,23,38,15,7000,29,7900,"<5",null,2012,3]
[9,"30 Välabäcken","2012-04-25",8.6,9.6999999999999993,83.356499577897537,7.94,1.7,71.7,33,48,12,5900,46,6300,"<5",null,2012,4]
[9,"30 Välabäcken","2012-05-29",12.2,7.8,72.968267547703064,7.98,1.6,69.8,50,99,24,4100,35,4800,"<5",null,2012,5]
[9,"30 Välabäcken","2012-06-26",13.1,9.1999999999999993,87.819172609689886,7.84,7.2,64.900000000000006,110,160,40,5400,76,6500,"<5",null,2012,6]
[9,"30 Välabäcken","2012-07-25",15,8.3000000000000007,82.561751499526096,7.9,1.4,70.900000000000006,110,150,10,4100,19,5200,"<5",null,2012,7]
[9,"30 Välabäcken","2012-08-27",16.899999999999999,10.4,107.60299272215038,8.14,1.4,71,150,200,20,4100,28,5100,"<5",null,2012,8]
[9,"30 Välabäcken","2012-09-24",11.3,10.1,92.558493085334305,7.99,2,71,87,120,10,4000,20,4300,"<5",null,2012,9]
[9,"30 Välabäcken","2012-10-30",6.9,10.199999999999999,84.012899139804261,7.76,15,69.2,67,130,62,5200,50,6000,8.3000000000000007,null,2012,10]
[9,"30 Välabäcken","2012-11-25",5.7,11.7,93.441730371417108,7.6,62,48.1,85,190,91,11000,"<10",11000,32,null,2012,11]
[9,"30 Välabäcken","2012-11-28",7.1,12.5,103.48003004727111,7.84,5,74.2,50,69,11,13000,23,13000,"<5",null,2012,11]
[9,"30 Välabäcken","2012-12-20",4,14.1,107.66148653658981,7.78,3.7,71.599999999999994,31,49,13,14000,"<10",14000,"<5",null,2012,12]
[9,"30 Välabäcken","2013-01-30",2.8,11.7,86.471481153244,7.66,117,38.700000000000003,33,360,340,5600,"<10",6000,100,null,2013,1]
[9,"30 Välabäcken","2013-02-26",3.1,12.8,95.38164738679265,7.98,3.8,71.900000000000006,39,55,13,8900,25,9600,"<5",null,2013,2]
[9,"30 Välabäcken","2013-03-26",1.3,14.8,104.91064712278937,8.06,4.5999999999999996,70,29,47,18,7600,25,7900,"<5",null,2013,3]
[9,"30 Välabäcken","2013-04-25",8.3000000000000007,11.6,98.951344993676102,7.97,1.7,71.3,39,59,15,6400,54,6200,"<5",null,2013,4]
[9,"30 Välabäcken","2013-05-29",11.9,9.6999999999999993,90.125965442653822,7.92,1.2,62,97,130,20,3800,39,4400,"<5",null,2013,5]
[9,"30 Välabäcken","2013-06-26",13.4,8.8000000000000007,84.559878678107651,7.85,1.9,73,220,240,20,4500,56,5400,"<5",null,2013,6]
[9,"30 Välabäcken","2013-07-25",13.7,8,77.380508461993045,7.77,0.9,70,71,100,18,2500,100,3100,"<5",null,2013,7]
[9,"30 Välabäcken","2013-08-27",14,9.1999999999999993,89.57134390604341,7.9,1.6,58.2,110,140,10,5200,18,6500,"<5",null,2013,8]
[9,"30 Välabäcken","2013-09-26",10.4,10.199999999999999,91.530983483759925,7.91,1.1000000000000001,72.8,130,150,20,4000,16,4700,"<5",null,2013,9]
[9,"30 Välabäcken","2013-10-29",10.6,9.1999999999999993,82.946821983404689,7.9,2.5,78.3,93,120,20,9300,28,10000,"<5",null,2013,10]
[9,"30 Välabäcken","2013-11-27",5.8,11.8,94.485483672044836,7.86,2.2000000000000002,79.099999999999994,59,94,10,11000,22,12000,"<5",null,2013,11]
[9,"30 Välabäcken","2013-12-23",5.6,11.6,92.402286786165931,7.88,2.8,73.900000000000006,28,48,7,14000,19,14000,"<5",null,2013,12]
[9,"30 Välabäcken","2014-01-28",1.6,13.4,95.791500541586842,7.96,26,74.5,61,73,"<5",10000,61,12000,24,null,2014,1]
[9,"30 Välabäcken","2014-02-27",4.5999999999999996,12.7,98.538185525285002,7.94,3,70.7,36,81,37,10000,27,10000,"<5",null,2014,2]
[9,"30 Välabäcken","2014-03-27",4.5,14.2,109.88406593247799,8.0500000000000007,1.9,72.900000000000006,27,46,14,7300,"<10",9100,"<5",null,2014,3]
[9,"30 Välabäcken","2014-04-29",9.3000000000000007,10.6,92.655506251645576,7.86,1.6,73.3,21,52,16,6100,14,7000,"<5",null,2014,4]
[9,"30 Välabäcken","2014-05-28",11.2,9.8000000000000007,89.601623407193799,7.95,1,74.2,68,93,13,7600,15,9000,"<5",null,2014,5]
[9,"30 Välabäcken","2014-06-24",12.1,9.1999999999999993,85.870191918177795,7.71,0.91,74.3,110,190,20,5800,17,7000,6.3,null,2014,6]
[9,"30 Välabäcken","2014-07-21",16.5,7.7,79.022500212703704,7.8,0.86,74.7,170,200,10,3900,28,4800,"<5",null,2014,7]
[9,"30 Välabäcken","2014-08-28",15.4,8.6999999999999993,87.274037022991479,7.78,1.1000000000000001,73.599999999999994,180,220,10,4200,16,5400,"<5",null,{"$f":"YEAR(C903)","v":2014},{"$f":"MONTH(C903)","v":8}]
[9,"30 Välabäcken","2014-09-30",12.2,8.3000000000000007,77.645720595632767,7.94,1.8,77.8,200,260,20,4000,24,4600,"<5",null,2014,9]
[9,"30 Välabäcken","2014-10-29",10.5,9.4,84.551033229584434,7.87,2,76.099999999999994,74,94,8,9100,50,10000,"<5",null,2014,10]
[9,"30 Välabäcken","2014-11-27",7.3,10.7,89.027082789677635,8.01,3.2,78.8,5.8,80,10,9100,19,8800,"<5",null,2014,11]
[9,"30 Välabäcken","2014-12-22",7.1,10.4,86.095384999329553,7.65,217,49.4,73,320,230,8500,"<10",9600,110,null,2014,12]
[9,"30 Välabäcken","2015-01-27",4.2,11.7,89.816415958943793,7.94,35,59.2,45,120,63,9100,"<10",10000,20,null,2015,1]
[9,"30 Välabäcken","2015-02-24",4,12.5,95.444580262934238,7.95,5,69.7,58,75,15,9100,20,9300,5,null,2015,2]
[9,"30 Välabäcken","2015-03-31",4.7,10.8,84.018876232572154,7.7,18,63.7,61,89,24,15000,120,15000,10,null,2015,3]
[9,"30 Välabäcken","2015-04-29",7.7,12,100.85014726596928,7.94,1.4,72,3.5,59,12,7000,12,7600,"<5",null,2015,4]
[9,"30 Välabäcken","2015-05-27",11.9,12.4,115.21257438029974,8.2100000000000009,2,70.400000000000006,30,65,21,850,12,5800,"<5",null,2015,5]
[9,"30 Välabäcken","2015-06-25",11.7,9.8000000000000007,90.639781560757072,7.97,1.1000000000000001,74.2,88,110,12,6300,34,7300,"<5",null,2015,6]
[9,"30 Välabäcken","2015-07-28",14.6,8.4,82.847462945075691,7.84,1.3,71.3,150,170,10,6500,77,6400,"<5",null,2015,7]
[9,"30 Välabäcken","2015-08-26",14.8,8.4,83.202071468664016,7.87,1.3,71.400000000000006,200,230,20,4400,24,4700,"<5",null,2015,8]
[9,"30 Välabäcken","2015-09-30",11.6,10.1,93.200460626450962,7.9,2,75.900000000000006,82,130,10,5300,14,5100,"<5",null,2015,9]
[9,"30 Välabäcken","2015-10-28",8.1999999999999993,9.5,80.837865039287294,7.87,1,75.900000000000006,190,220,10,5300,17,5100,"<5",null,2015,10]
[9,"30 Välabäcken","2015-12-21",7.6,10.6,88.861833416716124,7.86,2.8,72.599999999999994,40,80,9,11000,87,11000,"<5",null,2015,12]
[9,"30 Välabäcken","2016-01-27",4.5999999999999996,11.2,86.899817156156857,7.78,12,60.2,35,110,27,7400,"<10",8000,14,null,2016,1]
[9,"30 Välabäcken","2016-02-25",3.6,11.6,87.622552550130678,7.88,2.6,68.2,27,56,6,9600,18,9700,"<5",null,2016,2]
[9,"30 Välabäcken","2016-03-30",6.1,11.9,96.028689926130738,8.02,2.2999999999999998,71.2,14,50,18,7600,"<10",7500,"<5",null,2016,3]
[9,"30 Välabäcken","2016-04-27",5.7,10.199999999999999,81.462021349440548,7.9,9.5,61.5,60,150,40,6200,92,6700,20,null,2016,4]
[9,"30 Välabäcken","2016-05-31",16.2,8.5,86.697653075309873,7.9,1.5,69.5,160,190,20,4200,66,4600,"<5",null,2016,5]
[9,"30 Välabäcken","2016-06-28",15.3,7.9,79.08243127665132,7.86,1,72.400000000000006,160,240,20,5300,65,4700,"<5",null,2016,6]
[9,"30 Välabäcken","2016-07-26",16.5,7.7,79.022500212703704,7.85,0.85,73.599999999999994,130,170,"<5",6600,30,6600,"<5",null,2016,7]
[9,"30 Välabäcken","2016-08-30",14.7,8.1999999999999993,81.048011602308009,7.82,0.8,71.2,200,230,10,4300,14,4000,"<5",null,2016,8]
[9,"30 Välabäcken","2016-09-27",11.8,9,83.431321172622546,7.92,1.2,74.5,150,200,20,3800,15,3800,"<5",null,2016,9]
[9,"30 Välabäcken","2016-10-26",7.4,9.9,82.578337449902236,7.86,0.65,73,50,110,14,1800,"<10",2300,"<5",null,2016,10]
[9,"30 Välabäcken","2016-11-29",3.8,12,91.134997221088355,7.91,1.2,77.5,26,91,10,8600,34,9100,"<5",null,2016,11]
[9,"30 Välabäcken","2016-12-28",4,12.2,null,7.97,5.0999999999999996,74.099999999999994,47,76,20,16000,22,15000,"<5",null,2016,12]
[9,"30 Välabäcken","2017-01-31",3.8,11.7,88.856622290561134,7.89,1.8,75.8,52,73,"<5",12000,19,11000,"<5",null,2017,1]
[9,"30 Välabäcken","2017-02-28",5.0999999999999996,11.3,88.842078450645019,7.79,18,65.400000000000006,48,92,44,17000,13,16000,12,null,2017,2]
[9,"30 Välabäcken","2017-03-28",5.9,11.3,90.716730732931964,7.95,1.6,73.099999999999994,17,38,13,12000,"<10",13000,"<5",null,2017,3]
[9,"30 Välabäcken","2017-04-26",6.5,11.8,96.20544971329214,7.95,1.5,72.900000000000006,40,58,13,9100,23,9400,"<5",null,2017,4]
[9,"30 Välabäcken","2017-05-30",13.4,8.4,80.716247829102755,7.83,3.2,75.5,190,270,20,4200,350,4500,"<5",null,2017,5]
[9,"30 Välabäcken","2017-06-27",13.2,8.1,77.490566974460279,7.89,1.1000000000000001,74.3,210,260,10,3200,45,3800,"<5",null,2017,6]
[9,"30 Välabäcken","2017-07-31",15.4,7.6,76.239388663762668,7.83,2.8,74.599999999999994,200,230,"<5",3100,38,3400,"<5",null,2017,7]
[9,"30 Välabäcken","2017-08-29",14.9,8.5,84.371909110324566,7.88,1.9,76,170,210,"<5",3400,36,4000,"<5",null,2017,8]
[9,"30 Välabäcken","2017-09-25",13.4,8.5,81.677155541353983,7.86,1.8,77.7,78,100,"<5",8800,26,9600,"<5",null,2017,9]
[9,"30 Välabäcken","2017-10-31",8.5,10.3,88.295626087008088,7.95,8,74.400000000000006,50,66,9,12000,26,11000,"<5",null,2017,10]
[9,"30 Välabäcken","2017-11-21",5.7,11,87.851199494494722,7.84,6.3,77.3,36,53,12,12000,19,12000,"<5",null,2017,11]
[9,"30 Välabäcken","2017-12-28",6.1,10.5,84.731196993644772,7.79,5.5,71.7,51,66,14,12000,18,11000,5.0999999999999996,null,2017,12]
[9,"30 Välabäcken","2018-01-30",4.5,12.1,94,7.87,17,67.099999999999994,38,66,27,9800,16,9400,13,null,2018,1]
[9,"30 Välabäcken","2018-02-28",0,13.2,90,8.0399999999999991,8,68.8,81,140,40,11000,82,11000,7.8,null,2018,2]
[9,"30 Välabäcken","2018-03-27",2.8,11.8,87,7.93,4.0999999999999996,68.900000000000006,33,55,21,7700,22,8100,"<5",null,2018,3]
[9,"30 Välabäcken","2018-04-25",8.6999999999999993,9.4,81,7.92,2,74.8,21,63,17,6800,30,6600,"<5",null,2018,4]
[9,"30 Välabäcken","2018-05-29",15.6,9.1999999999999993,93,7.84,1.5,76.3,140,170,30,4000,110,4300,"<5",null,2018,5]
[9,"30 Välabäcken","2018-06-18",14.3,9.1,89,7.81,3.5,67.099999999999994,null,null,null,null,null,null,null,"Proverna försvunna ",2018,6]
[9,"30 Välabäcken","2018-07-16",16.8,8.8000000000000007,91,7.87,2.6,74.099999999999994,130,240,10,3000,41,3600,"<5",null,2018,7]
[9,"30 Välabäcken","2018-08-28",14.1,8.4,82,7.75,1.5,70.8,290,300,10,2800,38,3400,"<5",null,2018,8]
[9,"30 Välabäcken","2018-10-30",8,10.3,87,7.78,0.78,75.7,34,90,16,2900,19,3100,"<5",null,2018,10]
[9,"30 Välabäcken","2018-11-27",1.3,11.8,84,7.8,1.8,80.099999999999994,97,110,12,4300,150,4400,"<5",null,2018,11]
[9,"30 Välabäcken","2018-12-20",5,11.8,93,7.8,1.8,83,69,90,11,7900,19,7500,"<5",null,2018,12]
[9,"30 Välabäcken","2019-01-29",3.1,12,89,7.85,6.9,86.2,34,90,27,30000,63,36000,7.6,null,2019,1]
[9,"30 Välabäcken","2019-02-26",6.1,12.3,99,7.93,1.4,83.6,34,52,15,24000,30,27000,"<5",null,2019,2]
[9,"30 Välabäcken","2019-03-26",7.3,12.3,102,7.95,2.7,74,32,65,26,16000,22,16000,"<5",null,2019,3]
[9,"30 Välabäcken","2019-04-23",10.8,11,100,8.06,1.5,77,57,82,20,12000,32,10000,"<5",null,2019,4]
[9,"30 Välabäcken","2019-05-27",12.8,8.9,84,8.07,1,74.7,46,71,24,6800,22,7200,"<5",null,2019,5]
[9,"30 Välabäcken","2019-06-24",13.6,8.3000000000000007,80,7.8,1.9,77.2,110,140,10,7200,36,7800,"<5",null,2019,6]
[9,"30 Välabäcken","2019-07-22",14.8,7.2,71,7.77,2.6,78.3,110,120,10,6100,41,6400,"<5",null,2019,7]
[9,"30 Välabäcken","2019-08-27",16.8,7.1,73,7.7,1.1000000000000001,79.400000000000006,97,120,20,7200,20,7300,"<5",null,2019,8]
[9,"30 Välabäcken","2019-09-25",9.6,10.3,91,7.68,1.2,69,160,190,20,2500,11,3400,"<5",null,2019,9]
[9,"30 Välabäcken","2019-09-26",12.8,9.1,86,7.94,4.0999999999999996,77.5,76,110,33,5800,34,6500,7.4,null,2019,9]
[9,"30 Välabäcken","2019-10-21",11.4,9.8000000000000007,90,7.86,2.6,78.3,52,77,16,16000,14,18000,"<5",null,2019,10]
[9,"30 Välabäcken","2019-11-25",7.5,11.4,95,7.99,2,80.900000000000006,48,69,24,15000,32,16000,"<5",null,2019,11]
[9,"30 Välabäcken","2019-12-19",6.1,11.7,94,7.8,4.0999999999999996,73.3,36,64,21,16000,29,17000,"<5",null,2019,12]
[10,"16 Saxån vid Saxtorp","2010-01-26",-0.2,16.100000000000001,109.33935379097053,8,4.8,74.099999999999994,63,61,26,5000,110,5700,"<5",null,{"$f":"YEAR(C967)","v":2010},{"$f":"MONTH(C967)","v":1}]
[10,"16 Saxån vid Saxtorp","2010-02-22",0.1,14.1,96.589305906600273,8.01,7.8,67.3,64,70,27,4100,120,4400,"<5",null,2010,2]
[10,"16 Saxån vid Saxtorp","2010-03-24",4.0999999999999996,12.5,95.701041312356452,7.88,24,39.9,67,110,57,6500,48,7500,18,null,2010,3]
[10,"16 Saxån vid Saxtorp","2010-04-27",9.6,7.8,68.674693829479878,8.1999999999999993,2.2000000000000002,58.4,19,18,"<5",3300,19,3800,"<5",null,2010,4]
[10,"16 Saxån vid Saxtorp","2010-05-27",13.3,10.5,100.67303782177407,8.18,3,60.7,41,75,31,3300,21,4300,"<5",null,2010,5]
[10,"16 Saxån vid Saxtorp","2010-06-23",15.9,9.4,95.285004154954507,8.14,2.5,64,90,110,21,3300,63,4100,"<5",null,2010,6]
[10,"16 Saxån vid Saxtorp","2010-07-19",19.399999999999999,8.15,88.555200702807539,7.98,2,66.900000000000006,190,210,20,2300,58,2600,"<5",null,2010,7]
[10,"16 Saxån vid Saxtorp","2010-08-25",20.399999999999999,5.8,64.210522501791132,7.99,2.8,58.5,110,140,20,5400,29,5900,"<5",null,2010,8]
[10,"16 Saxån vid Saxtorp","2010-09-28",11.8,9.9,91.774453289884804,8.1199999999999992,3.6,62.4,67,80,9,6700,22,7100,"<5",null,2010,9]
[10,"16 Saxån vid Saxtorp","2010-10-26",7.4,10.6,88.417209794844823,7.9,33,54.5,78,130,59,11000,12,10000,13,null,2010,10]
[10,"16 Saxån vid Saxtorp","2010-11-23",5.0999999999999996,11.6,91.200717701547092,7.88,20,57.3,50,94,28,9400,28,9300,13,null,2010,11]
[10,"16 Saxån vid Saxtorp","2010-12-21",0.2,13.3,91.371443670429272,7.96,6.7,67.8,53,66,32,6800,82,7300,"<5",null,2010,12]
[10,"16 Saxån vid Saxtorp","2011-01-27",1.6,13.6,97.221224430267242,7.91,26,52.5,72,89,38,6200,40,6400,5.3,null,2011,1]
[10,"16 Saxån vid Saxtorp","2011-02-24",0.2,14,96.180467021504498,8.0399999999999991,5.9,66.7,65,75,18,5900,140,7000,"<5",null,2011,2]
[10,"16 Saxån vid Saxtorp","2011-03-29",5.5,13,103.28460573043668,8.27,2.5,57.7,23,32,10,5700,20,6500,"<5",null,2011,3]
[10,"16 Saxån vid Saxtorp","2011-04-27",13.5,10.5,101.1175485617926,8.09,2.5,60.6,33,47,25,3900,45,4400,"<5",null,2011,4]
[10,"16 Saxån vid Saxtorp","2011-05-24",14.3,8.8000000000000007,86.234961859312961,7.99,3.7,62.2,100,120,28,2900,150,3900,"<5",null,2011,5]
[10,"16 Saxån vid Saxtorp","2011-06-28",16.5,9.4,96.469026233690244,7.96,3.1,55.7,110,130,20,3900,56,4600,"<5",null,2011,6]
[10,"16 Saxån vid Saxtorp","2011-07-27",15,8.9,88.530070885033993,8,7.2,49.4,95,130,20,4000,31,5000,5.5,null,2011,7]
[10,"16 Saxån vid Saxtorp","2011-08-30",14.4,9.5,93.29527065594641,8,11,59.3,84,110,21,5400,38,6400,9,null,2011,8]
[10,"16 Saxån vid Saxtorp","2011-09-27",13.1,9.5,90.682841281744999,8.11,2.6,67.7,82,84,15,3900,23,4700,"<5",null,2011,9]
[10,"16 Saxån vid Saxtorp","2011-10-26",8.6999999999999993,10.6,91.31394990567928,8.0399999999999991,3.7,67.2,65,74,19,5100,53,5700,"<5",null,2011,10]
[10,"16 Saxån vid Saxtorp","2011-11-29",5.9,11.9,95.533548293972586,8.18,8,62.9,78,100,23,3400,60,3900,5.7,null,2011,11]
[10,"16 Saxån vid Saxtorp","2011-12-22",4.0999999999999996,12.3,94.169824651358752,8.09,7.4,63.3,47,67,24,6700,47,8200,"<5",null,2011,12]
[10,"16 Saxån vid Saxtorp","2012-01-27",1.7,13.5,96.777216871300197,7.96,9.5,64.5,42,66,26,7000,61,7800,6.7,null,2012,1]
[10,"16 Saxån vid Saxtorp","2012-02-28",3.1,13.3,99.107492987839237,7.92,16,51.8,55,81,21,4900,84,6000,11,null,2012,2]
[10,"16 Saxån vid Saxtorp","2012-03-29",8.1999999999999993,11,93.601738466543182,8.1999999999999993,3.7,62.5,32,50,18,4600,610,5200,"<5",null,2012,3]
[10,"16 Saxån vid Saxtorp","2012-04-25",9.8000000000000007,10.6,93.775186942954576,8.1199999999999992,2.2999999999999998,58.9,18,34,13,3100,30,3600,"<5",null,2012,4]
[10,"16 Saxån vid Saxtorp","2012-05-29",14.8,8.4,83.202071468664016,7.99,2.7,63.5,78,130,20,2500,86,3100,"<5",null,2012,5]
[10,"16 Saxån vid Saxtorp","2012-06-26",14.3,9.1,89.174790104516802,8,3.9,55.5,110,140,30,2400,62,2800,"<5",null,2012,6]
[10,"16 Saxån vid Saxtorp","2012-07-25",17.5,7.9,82.727109284405657,7.97,1.6,59.2,110,140,20,2000,44,2300,"<5",null,2012,7]
[10,"16 Saxån vid Saxtorp","2012-08-27",16.600000000000001,9.3000000000000007,95.637688876280464,7.96,1.3,63.4,98,130,10,1600,31,2100,"<5",null,2012,8]
[10,"16 Saxån vid Saxtorp","2012-09-24",11.2,9.1,83.201507449537075,8.02,2.8,63.4,78,110,10,2000,22,2300,"<5",null,2012,9]
[10,"16 Saxån vid Saxtorp","2012-10-30",5.4,11.6,91.921169654499906,7.96,6.4,65.099999999999994,71,100,30,3700,14,4200,5.7,null,2012,10]
[10,"16 Saxån vid Saxtorp","2012-11-25",5.3,12.6,99.58437536597657,7.86,48,53,76,180,83,9400,"<10",9700,39,null,2012,11]
[10,"16 Saxån vid Saxtorp","2012-11-28",6.6,13.1,107.07777199327295,7.99,26,54.8,62,90,31,8400,18,8900,14,null,2012,11]
[10,"16 Saxån vid Saxtorp","2012-12-20",3,13.6,101.0663653634156,7.89,16,55.3,45,82,31,9300,17,10000,11,null,2012,12]
[10,"16 Saxån vid Saxtorp","2013-01-30",1.9,12,86.50646504932557,7.92,57,54,130,230,130,4800,120,5400,52,null,2013,1]
[10,"16 Saxån vid Saxtorp","2013-02-26",2.1,13.9,100.76310126110839,8.09,4.7,63.9,34,51,13,6300,42,6400,"<5",null,2013,2]
[10,"16 Saxån vid Saxtorp","2013-03-26",0.9,14.9,104.43080134394242,8.18,3.6,63.3,21,35,14,5000,21,5400,"<5",null,2013,3]
[10,"16 Saxån vid Saxtorp","2013-04-25",9.4,11.5,100.76530892513263,8.14,2.1,58,21,37,9,3300,27,3700,"<5",null,2013,4]
[10,"16 Saxån vid Saxtorp","2013-05-29",14.7,8.6999999999999993,85.989963529278015,7.92,1.9,71.8,120,150,20,2300,110,3000,"<5",null,2013,5]
[10,"16 Saxån vid Saxtorp","2013-06-26",16.100000000000001,8.4,85.501295937765406,7.93,1.8,61.6,160,180,20,2300,63,2900,"<5",null,2013,6]
[10,"16 Saxån vid Saxtorp","2013-07-25",16.899999999999999,6.6,68.286514612133885,7.8,1.2,65.400000000000006,110,160,30,1500,32,2000,"<5",null,2013,7]
[10,"16 Saxån vid Saxtorp","2013-08-27",15.6,8.1,81.596193470933287,7.86,3.6,61.8,100,140,10,2400,32,2900,"<5",null,2013,8]
[10,"16 Saxån vid Saxtorp","2013-09-26",10.9,10.1,91.702751802416813,7.98,1.2,62.3,98,120,20,2500,27,2700,"<5",null,2013,9]
[10,"16 Saxån vid Saxtorp","2013-10-29",10.8,8.9,80.618905012826019,7.95,2.2999999999999998,63.4,68,92,10,5800,73,5600,"<5",null,2013,10]
[10,"16 Saxån vid Saxtorp","2013-11-27",4.3,12.7,97.754015295978732,8.0299999999999994,3.2,67,41,70,17,8000,37,9000,"<5",null,2013,11]
[10,"16 Saxån vid Saxtorp","2013-12-23",5.3,12,94.84226225331102,8.01,17,54.9,39,72,27,9300,12,9800,14,null,2013,12]
[10,"16 Saxån vid Saxtorp","2014-01-28",0.3,14.2,97.83494495940171,8.02,7.4,66.2,47,69,18,7600,83,8600,"<5",null,2014,1]
[10,"16 Saxån vid Saxtorp","2014-02-27",4.5999999999999996,12.7,98.538185525285002,8.0399999999999991,8.3000000000000007,59.4,40,64,18,7200,40,7600,"<5",null,2014,2]
[10,"16 Saxån vid Saxtorp","2014-03-27",4.9000000000000004,13,101.6703767893989,8.2200000000000006,3.1,56.7,15,34,12,3800,11,4700,"<5",null,2014,3]
[10,"16 Saxån vid Saxtorp","2014-04-29",12,10.3,95.919024208073097,8.09,2.5,60.3,21,44,12,3600,27,4500,"<5",null,2014,4]
[10,"16 Saxån vid Saxtorp","2014-05-28",13.6,9.3000000000000007,89.758065924709072,8,1.7,62.8,98,120,20,4200,79,5900,"<5",null,2014,5]
[10,"16 Saxån vid Saxtorp","2014-06-24",15.2,9.3000000000000007,92.901074816880438,7.94,1.5,66.7,100,160,20,2600,45,3800,"<5",null,2014,6]
[10,"16 Saxån vid Saxtorp","2014-07-21",19.3,7.7,83.507022923928815,7.87,1.2,56,150,200,10,2100,48,2300,"<5",null,2014,7]
[10,"16 Saxån vid Saxtorp","2014-08-28",16.8,8.8000000000000007,90.864508159609841,7.9,2.5,48.5,82,120,10,2300,19,2900,"<5",null,2014,8]
[10,"16 Saxån vid Saxtorp","2014-09-30",12.9,9,85.528854915732254,8.0500000000000007,2.2999999999999998,66.599999999999994,93,110,10,2300,22,2900,"<5",null,2014,9]
[10,"16 Saxån vid Saxtorp","2014-10-29",10.7,10.199999999999999,92.178726400118492,7.98,3.65,64.5,69,84,9,6500,30,7700,"<5",null,2014,10]
[10,"16 Saxån vid Saxtorp","2014-11-27",6.9,11.8,97.191393122518662,8.1999999999999993,12,62.7,58,78,11,6700,21,7400,6,null,2014,11]
[10,"16 Saxån vid Saxtorp","2014-12-22",6.6,11.2,91.547408116386038,7.89,43,53.8,57,120,51,8000,18,8600,17,"översvämn",2014,12]
[10,"16 Saxån vid Saxtorp","2015-01-27",3.9,12.1,92.142302100835565,7.77,42,58.3,48,100,44,7100,35,8000,26,null,2015,1]
[10,"16 Saxån vid Saxtorp","2015-02-24",3.5,12.9,97.178758755261128,8.08,17,55.5,46,73,25,6700,41,7100,14,null,2015,2]
[10,"16 Saxån vid Saxtorp","2015-03-31",4.5999999999999996,10.9,84.572143482331228,7.83,90,42.2,140,260,150,13000,360,13000,77,null,2015,3]
[10,"16 Saxån vid Saxtorp","2015-04-29",8.9,11.4,98.686205866501439,8.17,2.8,59.6,4.4000000000000004,47,10,4300,26,4800,"<5",null,{"$f":"YEAR(C1031)","v":2015},{"$f":"MONTH(C1031)","v":4}]
[10,"16 Saxån vid Saxtorp","2015-05-27",12,10.1,94.056518883644486,8.19,2.5,61.2,40,63,16,1100,26,4200,"<5",null,2015,5]
[10,"16 Saxån vid Saxtorp","2015-06-25",12.8,10.199999999999999,96.71665321808446,8.0299999999999994,2.2000000000000002,58.6,65,110,15,3200,48,3900,"<5",null,2015,6]
[10,"16 Saxån vid Saxtorp","2015-07-28",15.8,8.5,85.983263354844425,7.99,2,58.9,110,120,"<5",2300,38,2600,"<5",null,2015,7]
[10,"16 Saxån vid Saxtorp","2015-08-26",16.5,7.7,79.022500212703704,7.87,1.7,66.5,120,150,10,2200,59,2600,"<5",null,2015,8]
[10,"16 Saxån vid Saxtorp","2015-09-30",11.5,9.4,86.541854321364653,7.9,3.3,65.599999999999994,82,130,"<5",3400,28,3800,"<5",null,2015,9]
[10,"16 Saxån vid Saxtorp","2015-10-28",8.4,9.6999999999999993,82.947956707869537,7.93,1.4,68.099999999999994,82,110,"<5",2800,"<10",3200,"<5",null,2015,10]
[10,"16 Saxån vid Saxtorp","2015-12-21",7.8,11.2,94.361963291437377,8.01,7.9,60.7,37,76,"<5",7700,44,7700,6.1,null,2015,12]
[10,"16 Saxån vid Saxtorp","2016-01-27",3.2,12.3,91.906220713625075,7.84,49,37.700000000000003,58,180,50,4200,110,4800,47,null,2016,1]
[10,"16 Saxån vid Saxtorp","2016-02-25",3.2,11.5,85.92858034200718,8.0299999999999994,11,54.4,36,68,"<5",7000,"<10",7000,11,null,2016,2]
[10,"16 Saxån vid Saxtorp","2016-03-30",7.1,11.4,94.373787403111237,8.25,2.9,60.4,12,46,17,4900,11,4800,"<5",null,2016,3]
[10,"16 Saxån vid Saxtorp","2016-04-27",6.4,10.5,85.387516825102779,8.08,3.5,58.7,19,54,9,3900,84,4200,"<5",null,2016,4]
[10,"16 Saxån vid Saxtorp","2016-05-31",18.600000000000001,8.3000000000000007,88.813630576442691,7.98,2.6,64.7,130,150,20,2900,170,3500,"<5",null,2016,5]
[10,"16 Saxån vid Saxtorp","2016-06-28",18.399999999999999,8.1999999999999993,87.403668753828811,8.01,2.2999999999999998,61.7,140,200,20,1900,57,2100,"<5",null,2016,6]
[10,"16 Saxån vid Saxtorp","2016-07-26",19.600000000000001,7.7,83.982538199080608,7.99,2,64.599999999999994,100,140,10,3200,36,3300,"<5",null,2016,7]
[10,"16 Saxån vid Saxtorp","2016-08-30",16.2,8.3000000000000007,84.657708297067288,7.89,2.1,62.6,110,130,10,2000,19,2100,"<5",null,2016,8]
[10,"16 Saxån vid Saxtorp","2016-09-27",13.9,9,87.433822151478594,7.95,1.7,67.599999999999994,76,110,16,2000,20,2200,"<5",null,2016,9]
[10,"16 Saxån vid Saxtorp","2016-10-26",7.4,9.8000000000000007,81.744212829196158,7.93,2.2000000000000002,61.8,110,140,10,3000,15,3600,"<5",null,2016,10]
[10,"16 Saxån vid Saxtorp","2016-11-29",3.1,13.6,101.3430003484672,8.08,2,67.8,15,73,6,6900,36,7500,"<5",null,2016,11]
[10,"16 Saxån vid Saxtorp","2016-12-28",3.5,12.6,null,8.09,16,59.2,42,77,13,12000,18,12000,9.1999999999999993,null,2016,12]
[10,"16 Saxån vid Saxtorp","2017-01-31",2.8,13.1,96.818495992093716,8.07,3,66.900000000000006,37,56,"<5",9300,33,8700,"<5",null,2017,1]
[10,"16 Saxån vid Saxtorp","2017-02-28",5,11.5,90.176756954106295,7.85,35,45.7,55,130,64,12000,98,12000,21,"översvämn",2017,2]
[10,"16 Saxån vid Saxtorp","2017-03-28",6.6,12.2,99.721283841063368,8.1199999999999992,3.9,62.9,20,35,10,8700,20,8800,"<5",null,2017,3]
[10,"16 Saxån vid Saxtorp","2017-04-26",7.4,11.8,98.426705243317826,8.1999999999999993,2.2000000000000002,60.9,14,28,7,5500,11,5900,"<5",null,2017,4]
[10,"16 Saxån vid Saxtorp","2017-05-30",16.100000000000001,8.1,82.447678225702347,7.93,2.1,67.2,120,140,20,2700,130,3100,"<5",null,2017,5]
[10,"16 Saxån vid Saxtorp","2017-06-27",14.9,8.3000000000000007,82.386687719493395,8.0500000000000007,1.7,65,150,180,10,2500,48,2800,"<5",null,2017,6]
[10,"16 Saxån vid Saxtorp","2017-07-31",16.8,8.1,83.6366495560045,7.91,1.7,55.1,140,160,10,2100,41,2600,"<5",null,2017,7]
[10,"16 Saxån vid Saxtorp","2017-08-29",16.5,9.1999999999999993,94.416493760632989,8.0399999999999991,3.3,59.5,86,110,14,3900,34,4400,"<5",null,2017,8]
[10,"16 Saxån vid Saxtorp","2017-09-25",14.5,9,88.575091075232208,8.11,4.5999999999999996,64.7,65,89,11,5600,25,6500,"<5",null,2017,9]
[10,"16 Saxån vid Saxtorp","2017-10-31",7.3,11,91.523169223033079,7.95,38,51.2,74,130,48,7300,20,6500,14,null,2017,10]
[10,"16 Saxån vid Saxtorp","2017-11-21",4.3,12.3,94.675148672483346,8.0299999999999994,20,59,48,90,39,7500,16,7600,5.8,null,2017,11]
[10,"16 Saxån vid Saxtorp","2017-12-28",5.3,11,86.938740398868433,7.96,22,54.9,55,80,22,7300,32,7200,14,null,2017,12]
[10,"16 Saxån vid Saxtorp","2018-01-30",4.8,12.3,96,8.0299999999999994,117,43.4,59,360,310,5300,"<10",5600,82,null,2018,1]
[10,"16 Saxån vid Saxtorp","2018-02-28",0.1,14.3,98,7.9,8.5,77.5,48,78,28,6900,110,7100,6.2,"is",2018,2]
[10,"16 Saxån vid Saxtorp","2018-03-27",4.0999999999999996,11.7,90,8.07,9.5,60.9,41,67,27,5500,54,5700,7.5,null,2018,3]
[10,"16 Saxån vid Saxtorp","2018-04-25",10.199999999999999,9.9,88,8.14,2.2999999999999998,63.1,11,37,11,4700,24,4500,"<5",null,2018,4]
[10,"16 Saxån vid Saxtorp","2018-05-29",18.100000000000001,8.6999999999999993,92,7.94,3.2,71.099999999999994,130,140,20,3300,96,3700,"<5",null,2018,5]
[10,"16 Saxån vid Saxtorp","2018-06-18",16.5,8.4,86,7.89,2.2000000000000002,69.7,null,null,null,null,null,null,null,"Proverna försvunna ",2018,6]
[10,"16 Saxån vid Saxtorp","2018-07-16",19.100000000000001,8,86,7.9,1.7,70.3,130,150,10,2800,28,3300,"<5",null,2018,7]
[10,"16 Saxån vid Saxtorp","2018-08-28",15.4,8,80,7.82,3.3,64.3,110,140,20,1600,26,2100,5.9,null,2018,8]
[10,"16 Saxån vid Saxtorp","2018-10-30",7.6,11.3,95,7.95,1.7,70.8,72,85,15,1700,13,2100,"<5",null,2018,10]
[10,"16 Saxån vid Saxtorp","2018-11-27",1.6,11.6,83,7.89,2,71.8,72,90,23,2600,25,2900,"<5",null,2018,11]
[10,"16 Saxån vid Saxtorp","2018-12-20",3.7,12.9,98,7.94,2.2000000000000002,74.2,54,67,9,9400,39,9000,"<5",null,2018,12]
[10,"16 Saxån vid Saxtorp","2019-01-29",3.4,12.8,96,7.99,15,70.3,43,98,48,15000,57,15000,14,null,2019,1]
[10,"16 Saxån vid Saxtorp","2019-02-26",5.4,12.8,101,8.07,5.7,67.599999999999994,34,49,16,18000,20,18000,"<5",null,2019,2]
[10,"16 Saxån vid Saxtorp","2019-03-26",6.3,11.6,94,8.02,7,62,36,60,25,10000,22,10000,6.8,null,2019,3]
[10,"16 Saxån vid Saxtorp","2019-04-23",11,10.7,97,8.14,3.3,67.2,29,53,23,6700,16,6600,"<5",null,2019,4]
[10,"16 Saxån vid Saxtorp","2019-05-27",13.5,8.6999999999999993,84,8.1199999999999992,2.2999999999999998,66,75,110,31,4000,81,4600,"<5",null,2019,5]
[10,"16 Saxån vid Saxtorp","2019-06-24",16.8,8.1999999999999993,85,7.98,2.1,65,120,150,10,4400,50,4900,"<5",null,2019,6]
[10,"16 Saxån vid Saxtorp","2019-07-22",17,7.9,82,7.88,3,66.3,120,130,10,3400,37,3600,"<5",null,2019,7]
[10,"16 Saxån vid Saxtorp","2019-08-27",18.3,8.3000000000000007,88,7.75,3.4,66.099999999999994,120,150,20,4200,54,4600,"<5",null,2019,8]
[10,"16 Saxån vid Saxtorp","2019-09-25",11.5,9.3000000000000007,86,7.78,2.6,67.3,94,110,"<5",1600,15,2200,"<5",null,2019,9]
[10,"16 Saxån vid Saxtorp","2019-09-26",13.1,8.6999999999999993,83,7.96,3.5,69.3,87,120,22,3600,25,4000,"<5",null,2019,9]
[10,"16 Saxån vid Saxtorp","2019-10-21",11.4,10,92,7.91,4.0999999999999996,66.8,59,78,11,11000,13,12000,"<5",null,2019,10]
[10,"16 Saxån vid Saxtorp","2019-11-25",7.1,11.7,98,8.08,3.9,69.2,41,71,12,11000,25,11000,"<5",null,2019,11]
[10,"16 Saxån vid Saxtorp","2019-12-19",5.7,12.1,97,7.97,11.4,59.5,44,93,39,12000,29,13000,10,"Högt flöde, uppskattat",2019,12]
[1,"14 Svalövsbäcken uppstr Svalöv","2020-01-27",5.0999999999999996,11.8,93,7.96,6.4,44.6,22,41,20,6900,30,6700,"<5","Resultatet av kväve total, N, är mindre än summan av ammoniumkväve, NH4-N, och nitrat + nitritkväve, NO23-N. Skillnaden ligger dock inommätosäkerheten.",{"$f":"YEAR(C1087)","v":2020},{"$f":"MONTH(C1087)","v":1}]
[1,"14 Svalövsbäcken uppstr Svalöv","2020-02-25",4.9000000000000004,11.2,88,7.58,20,32.799999999999997,22,62,34,6300,22,6600,9.5,"Värden från Synlab korr. 12/5 -20, se kommentarsflik",2020,2]
[1,"14 Svalövsbäcken uppstr Svalöv","2020-03-24",5.5,13.2,105,7.91,5.8,41.2,13,39,20,5000,31,4700,5.9,"Syrgas mättes på labb, se kommentarsflik; Resultatet av kväve total, N, är mindre än summan av ammoniumkväve, NH4-N, och nitrat +nitritkväve, NO23-N. Skillnaden ligger dock inom mätosäkerheten.",2020,3]
[1,"14 Svalövsbäcken uppstr Svalöv","2020-04-21",12.3,12.8,120,8.61,5.0999999999999996,46.4,4.4000000000000004,44,31,2500,44,3000,5,"",2020,4]
[1,"14 Svalövsbäcken uppstr Svalöv","2020-05-26",16.899999999999999,8.8000000000000007,91,8.2100000000000009,12,51.4,22,77,46,1100,68,1800,12,"",2020,5]
[1,"14 Svalövsbäcken uppstr Svalöv","2020-06-23",20.2,4.3,47,7.83,9.4,53.3,61,140,41,280,55,1200,8.8000000000000007,"",2020,6]
[1,"14 Svalövsbäcken uppstr Svalöv","2020-07-21",18.7,4.7,50,7.9,7,51.4,57,150,56,590,84,1600,8,"",2020,7]
[1,"14 Svalövsbäcken uppstr Svalöv","2020-08-18",21.8,5.0999999999999996,58,7.98,9,53.9,190,290,90,110,26,1300,14,"",2020,8]
[1,"14 Svalövsbäcken uppstr Svalöv","2020-09-21",15.3,7.6,76,7.91,7,59.6,95,150,50,270,34,980,10,"",2020,9]
[1,"14 Svalövsbäcken uppstr Svalöv","2020-10-21",8.6,8.9,76,7.86,8.1,56.7,16,94,62,1100,81,1800,7,"",2020,10]
[1,"14 Svalövsbäcken uppstr Svalöv","2020-11-26",7.7,11,92,7.87,5.2,52.6,19,47,23,9600,29,10000,3.7,"",2020,11]
[1,"14 Svalövsbäcken uppstr Svalöv","2020-12-21",5.4,11.5,91,7.86,8.5,52.8,21,44,17,9300,32,11000,5.5,"",2020,12]
[2,"15:2 Svalövsbäcken nedstr Svalöv","2020-01-27",5.5,11.6,92,7.99,6.5,51.1,30,50,"",7600,310,7600,5.9,"Resultatet av kväve total, N, är mindre än summan av ammoniumkväve, NH4-N, och nitrat + nitritkväve, NO23-N. Skillnaden ligger dock inommätosäkerheten.",2020,1]
[2,"15:2 Svalövsbäcken nedstr Svalöv","2020-02-25",5.5,11.2,89,7.7,40,37.9,32,96,"",6400,25,6700,15,"Värden från Synlab korr. 12/5 -20, se kommentarsflik",2020,2]
[2,"15:2 Svalövsbäcken nedstr Svalöv","2020-03-24",5.7,13.9,111,8.1199999999999992,4,48.6,15,38,"",5700,270,5300,3.2,"Resultatet av kväve total, N, är mindre än summan av ammoniumkväve, NH4-N, och nitrat +nitritkväve, NO23-N. Skillnaden ligger dock inom mätosäkerheten.",2020,3]
[2,"15:2 Svalövsbäcken nedstr Svalöv","2020-04-21",10.6,16.3,147,8.3800000000000008,2,56.7,12,40,"",4200,240,4900,"<2","",2020,4]
[2,"15:2 Svalövsbäcken nedstr Svalöv","2020-05-26",16.3,15.9,163,8.51,1.7,59.3,12,60,"",4000,13,4400,4.2,"",2020,5]
[2,"15:2 Svalövsbäcken nedstr Svalöv","2020-06-23",16.3,6.4,65,7.64,1.8,64.8,190,210,"",6200,230,6300,2.4,"Resultatet av kväve total, N, är mindre än summan av ammoniumkväve, NH4-N, och nitrat +nitritkväve, NO23-N. Skillnaden ligger dock inom mätosäkerheten.",2020,6]
[2,"15:2 Svalövsbäcken nedstr Svalöv","2020-07-21",15.2,10.1,101,7.92,2,70.3,140,180,"",8700,150,8900,"<2","",2020,7]
[2,"15:2 Svalövsbäcken nedstr Svalöv","2020-08-18",17.8,5.0999999999999996,54,7.67,1.7,75.2,390,420,"",6300,2500,9800,2.4,"",2020,8]
[2,"15:2 Svalövsbäcken nedstr Svalöv","2020-09-21",14.4,6.8,67,7.66,1.3,74.5,470,490,"",12000,1500,13000,2.4,"Resultatet av kväve total, N, är mindre än summanav ammoniumkväve, NH4-N, och nitrat + nitritkväve, NO23-N. Skillnaden ligger dock inommätosäkerheten.",2020,9]
[2,"15:2 Svalövsbäcken nedstr Svalöv","2020-10-21",10.6,5.4,49,7.53,2.95,69.599999999999994,380,400,"",6900,2700,8400,"<2","Resultatet av kväve total, N, är mindre än summan av ammoniumkväve, NH4-N, och nitrat + nitritkväve, NO23-N. Skillnaden ligger dock inommätosäkerheten.",2020,10]
[2,"15:2 Svalövsbäcken nedstr Svalöv","2020-11-26",8.1,10.8,92,7.95,10,55.6,33,65,"",9300,220,10000,8.4,"",2020,11]
[2,"15:2 Svalövsbäcken nedstr Svalöv","2020-12-21",6.6,11.7,96,7.87,17,55.8,31,76,"",9400,140,11000,12,"",2020,12]
[3,"3:2 Örstorpsbäcken","2020-01-27",5.5,11.6,92,8.08,10,73.8,76,110,45,15000,26,16000,9.4,"",2020,1]
[3,"3:2 Örstorpsbäcken","2020-02-25",5.7,11.6,93,7.81,222,51.7,61,360,300,10000,"<10",11000,140,"Värden från Synlab korr. 12/5 -20, se kommentarsflik",2020,2]
[3,"3:2 Örstorpsbäcken","2020-03-24",3.7,12.7,96,7.95,8.9,72.5,92,130,53,11000,19,10000,9.3000000000000007,"Resultatet av kväve total, N, är mindre än summan av ammoniumkväve, NH4-N, och nitrat +nitritkväve, NO23-N. Skillnaden ligger dock inom mätosäkerheten.",2020,3]
[3,"3:2 Örstorpsbäcken","2020-04-21",8.6999999999999993,12.3,106,8.07,2.8,70.099999999999994,89,130,32,6100,36,6400,"<2","",2020,4]
[3,"3:2 Örstorpsbäcken","2020-05-26",13.2,10.6,101,8.01,2.9,72.3,170,190,30,4000,53,4200,"<2","",2020,5]
[3,"3:2 Örstorpsbäcken","2020-06-23",16.600000000000001,7.8,80,7.87,4.9000000000000004,70.8,34,390,60,3900,97,4100,5.8,"",2020,6]
[3,"3:2 Örstorpsbäcken","2020-07-21",14.6,8.3000000000000007,82,7.97,5.0999999999999996,70.900000000000006,260,320,20,4000,60,4500,4.9000000000000004,"",2020,7]
[3,"3:2 Örstorpsbäcken","2020-08-18",16.5,7.8,80,7.98,4.5999999999999996,71.099999999999994,290,340,30,3700,48,4400,4.9000000000000004,"",2020,8]
[3,"3:2 Örstorpsbäcken","2020-09-21",12.8,9.6999999999999993,92,8.07,4.4000000000000004,69.5,200,220,20,3300,21,3200,5.2,"Resultatet av kväve total, N, är mindre än summan av ammoniumkväve, NH4-N, och nitrat + nitritkväve, NO23-N. Skillnaden ligger dock inommätosäkerheten.",2020,9]
[3,"3:2 Örstorpsbäcken","2020-10-21",9.5,9.8000000000000007,86,7.92,3.63,69.2,190,200,20,3600,21,3800,2.7,"",2020,10]
[3,"3:2 Örstorpsbäcken","2020-11-26",8.3000000000000007,10.3,88,8,2.2999999999999998,75.5,120,130,10,10000,20,11000,"<2","",2020,11]
[3,"3:2 Örstorpsbäcken","2020-12-21",6.9,10.9,90,7.98,8.9,73,79,110,27,13000,25,14000,7.1,"",2020,12]
[4,"5 Braån vid Asmundtorp","2020-01-27",5.0999999999999996,12,94,8.14,8.1,54.1,42,63,30,8600,34,8400,6.3,"Resultatet av kväve total, N, är mindre än summan av ammoniumkväve, NH4-N, och nitrat + nitritkväve, NO23-N. Skillnaden ligger dock inommätosäkerheten.",2020,1]
[4,"5 Braån vid Asmundtorp","2020-02-25",5.0999999999999996,11,86,7.95,79,44,49,170,130,7300,39,7600,44,"Värden från Synlab korr. 12/5 -20, se kommentarsflik",2020,2]
[4,"5 Braån vid Asmundtorp","2020-03-24",4,12.7,97,8.02,6.6,54.9,28,57,27,6400,28,6100,7,"Resultatet av kväve total, N, är mindre än summan av ammoniumkväve, NH4-N, och nitrat +nitritkväve, NO23-N. Skillnaden ligger dock inom mätosäkerheten.",2020,3]
[4,"5 Braån vid Asmundtorp","2020-04-21",8.6999999999999993,11.4,98,8.08,2.9,61,12,33,14,4400,20,4700,"<2","",2020,4]
[4,"5 Braån vid Asmundtorp","2020-05-26",13.6,9.4,91,7.98,2.2999999999999998,54,46,74,18,2000,46,2500,2.5,"",2020,5]
[4,"5 Braån vid Asmundtorp","2020-06-23",16.7,7.1,73,7.86,4.5999999999999996,62.3,190,240,20,4500,66,4700,3.8,"",2020,6]
[4,"5 Braån vid Asmundtorp","2020-07-21",15.4,8.1,81,7.97,3,54.6,120,150,20,1700,31,2200,4.3,"",2020,7]
[4,"5 Braån vid Asmundtorp","2020-08-18",17.399999999999999,6.9,72,7.96,3.7,67.400000000000006,110,140,20,1400,33,2000,4.5999999999999996,"",2020,8]
[4,"5 Braån vid Asmundtorp","2020-09-21",13.1,9.1999999999999993,88,8.0299999999999994,2.7,60.9,120,130,10,1700,31,2000,3.4,"",2020,9]
[4,"5 Braån vid Asmundtorp","2020-10-21",8.6999999999999993,10.1,87,7.93,1.93,66.2,100,110,"<5",3800,14,4100,"<2","",2020,10]
[4,"5 Braån vid Asmundtorp","2020-11-26",8.5,11.2,96,8.14,6.9,57.5,42,65,18,9900,19,10000,4.3,"",2020,11]
[4,"5 Braån vid Asmundtorp","2020-12-21",6.5,11.6,95,8.02,12,57.9,38,73,29,9700,34,11000,10,"",2020,12]
[5,"28:2 Bäck N Trolleholm","2020-02-25",5,11.2,88,7.79,8.6999999999999993,31.3,5.3,26,"",2000,18,2400,5.8,"Värden från Synlab korr. 12/5 -20, se kommentarsflik",2020,2]
[5,"28:2 Bäck N Trolleholm","2020-03-24",5.5,13.3,106,7.99,3.1,45.7,3.5,13,"",1100,22,1200,2.7,"Syrgas mättes på labb, se kommentarsflik",2020,3]
[5,"28:2 Bäck N Trolleholm","2020-05-26",14.4,9.1999999999999993,90,8.07,3.3,55.6,5.8,19,"",290,24,650,3.1,"",2020,5]
[5,"28:2 Bäck N Trolleholm","2020-08-18","","","","","","","","","","","","","","Provpunkten var torr",2020,8]
[5,"28:2 Bäck N Trolleholm","2020-10-21",8.9,9.6999999999999993,84,7.88,2.19,67.7,6.8,14,"",250,23,590,"<2","",2020,10]
[5,"28:2 Bäck N Trolleholm","2020-12-21",6.2,11.6,94,7.87,8.1999999999999993,46.9,4.7,24,"",2700,24,3400,5.8,"",2020,12]
[6,"26 Långgropen uppstr Eslöv","2020-01-27",5.2,11.2,88,7.91,9.5,52.9,30,53,25,8100,26,8000,7.2,"Resultatet av kväve total, N, är mindre än summan av ammoniumkväve, NH4-N, och nitrat + nitritkväve, NO23-N. Skillnaden ligger dock inommätosäkerheten.",2020,1]
[6,"26 Långgropen uppstr Eslöv","2020-02-25",5.4,11.1,88,7.65,33,38.1,37,96,55,6300,24,6500,15,"Värden från Synlab korr. 12/5 -20, se kommentarsflik",2020,2]
[6,"26 Långgropen uppstr Eslöv","2020-03-24",5.6,13.3,106,7.96,6.5,56.1,18,42,24,5900,24,5500,5.8,"Syrgas mättes på labb, se kommentarsflik; Resultatet av kväve total, N, är mindre än summan av ammoniumkväve, NH4-N, och nitrat +nitritkväve, NO23-N. Skillnaden ligger dock inom mätosäkerheten.",2020,3]
[6,"26 Långgropen uppstr Eslöv","2020-04-21",10.8,16.100000000000001,146,8.3800000000000008,3.5,61.6,6.5,39,31,3400,12,3700,2.6,"",2020,4]
[6,"26 Långgropen uppstr Eslöv","2020-05-26",15.6,10.8,109,8.1199999999999992,2.7,61.2,19,41,21,2000,37,2300,2.7,"",2020,5]
[6,"26 Långgropen uppstr Eslöv","2020-06-23",16,7.7,78,7.7,2.8,61.2,51,85,23,1700,50,2200,"<2","",2020,6]
[6,"26 Långgropen uppstr Eslöv","2020-07-21",13.9,8.3000000000000007,81,7.72,2,65.2,33,53,15,1200,24,1600,"<2","",2020,7]
[6,"26 Långgropen uppstr Eslöv","2020-08-18",16.7,5.6,58,7.96,2.6,71.900000000000006,12,47,17,730,32,1200,3.2,"",2020,8]
[6,"26 Långgropen uppstr Eslöv","2020-09-21",12.3,8.3000000000000007,78,7.77,1.6,70.099999999999994,35,42,9,1100,19,1500,"<2","",2020,9]
[6,"26 Långgropen uppstr Eslöv","2020-10-21",8.5,9.9,85,7.8,1.47,67.3,38,50,12,2400,13,2700,"<2","",2020,10]
[6,"26 Långgropen uppstr Eslöv","2020-11-26",8,10.4,88,7.86,11,56.7,39,85,40,8500,28,8300,16,"Viss grumlighet i botten av provflaskan syntes vid Ekologigruppens analys; Resultatet av kväve total, N, är mindre än summan av ammoniumkväve, NH4-N, och nitrat + nitritkväve, NO23-N. Skillnaden ligger dock inommätosäkerheten.",{"$f":"YEAR(C1151)","v":2020},{"$f":"MONTH(C1151)","v":11}]
[6,"26 Långgropen uppstr Eslöv","2020-12-21",6.8,11.1,91,7.77,24,50.8,39,97,48,9100,15,9800,15,"",2020,12]
[7,"24 Långgropen nedstr Eslöv","2020-01-27",5.4,11.1,88,7.92,9.6,54.2,32,55,"",7800,40,7700,7.4,"Resultatet av kväve total, N, är mindre än summan av ammoniumkväve, NH4-N, och nitrat + nitritkväve, NO23-N. Skillnaden ligger dock inommätosäkerheten.",2020,1]
[7,"24 Långgropen nedstr Eslöv","2020-02-25",5.6,11.4,91,7.67,33,39.1,35,100,"",6100,32,6300,15,"Värden från Synlab korr. 12/5 -20, se kommentarsflik",2020,2]
[7,"24 Långgropen nedstr Eslöv","2020-03-24",5.2,12.7,100,7.89,5.9,58.7,15,45,"",5600,48,5300,4.9000000000000004,"Syrgas mättes på labb, se kommentarsflik; Resultatet av kväve total, N, är mindre än summan av ammoniumkväve, NH4-N, och nitrat +nitritkväve, NO23-N. Skillnaden ligger dock inom mätosäkerheten.",2020,3]
[7,"24 Långgropen nedstr Eslöv","2020-04-21",10.1,12,107,8,4.0999999999999996,65.400000000000006,7.6,43,"",3200,56,3400,2.9,"",2020,4]
[7,"24 Långgropen nedstr Eslöv","2020-05-26",13.7,8.9,86,7.8,3.5,58.5,28,54,"",1700,110,2100,3.1,"",2020,5]
[7,"24 Långgropen nedstr Eslöv","2020-06-23",15.8,6.8,69,7.62,2.7,61,53,82,"",1300,110,1900,2.5,"",2020,6]
[7,"24 Långgropen nedstr Eslöv","2020-07-21",14.2,7.7,75,7.69,5.2,67,33,69,"",1200,45,1400,3.2,"",2020,7]
[7,"24 Långgropen nedstr Eslöv","2020-08-18",16,6.1,62,7.96,2.4,75.599999999999994,31,100,"",930,25,1400,16,"",2020,8]
[7,"24 Långgropen nedstr Eslöv","2020-09-21",13,8,76,7.73,2.2999999999999998,71.5,38,50,"",1200,32,1300,"<2","",2020,9]
[7,"24 Långgropen nedstr Eslöv","2020-10-21",9,8.6999999999999993,75,7.67,3.66,66.7,35,54,"",2100,35,2300,2.1,"",2020,10]
[7,"24 Långgropen nedstr Eslöv","2020-11-26",8,10.4,88,7.84,4.9000000000000004,56.8,40,57,"",8000,64,8000,2.4,"Resultatet av kväve total, N, är mindre än summan av ammoniumkväve, NH4-N, och nitrat + nitritkväve, NO23-N. Skillnaden ligger dock inommätosäkerheten.",2020,11]
[7,"24 Långgropen nedstr Eslöv","2020-12-21",6.8,11.1,91,7.77,25,50.3,37,97,"",8000,18,9200,16,"",2020,12]
[8,"19 Saxån vid Annelöv","2020-02-25",5.2,11.4,90,8,24,46.7,44,96,"",7600,18,7900,19,"Värden från Synlab korr. 12/5 -20, se kommentarsflik",2020,2]
[8,"19 Saxån vid Annelöv","2020-03-24",4.0999999999999996,13.5,103,8.11,12,59.4,30,72,"",6100,18,5700,13,"Resultatet av kväve total, N, är mindre än summan av ammoniumkväve, NH4-N, och nitrat +nitritkväve, NO23-N. Skillnaden ligger dock inom mätosäkerheten.",2020,3]
[8,"19 Saxån vid Annelöv","2020-05-26",14.4,9.5,93,8.08,1.9,59.6,37,60,"",1500,43,1900,"<2","",2020,5]
[8,"19 Saxån vid Annelöv","2020-08-18",18.399999999999999,6.2,66,7.96,2.2000000000000002,67.900000000000006,100,130,"",910,42,1300,3.4,"",2020,8]
[8,"19 Saxån vid Annelöv","2020-10-21",8.4,9.6999999999999993,83,7.89,2.11,66.3,61,71,"",2600,15,2800,"<2","",2020,10]
[8,"19 Saxån vid Annelöv","2020-12-21",6.3,11.8,96,8.15,7.4,61.7,42,71,"",7700,42,9000,6.8,"",2020,12]
[9,"30 Välabäcken","2020-01-27",5.6,11.6,92,8.08,2.9,75.099999999999994,49,63,22,14000,19,14000,"<5","Resultatet av kväve total, N, är mindre än summan av ammoniumkväve, NH4-N, och nitrat + nitritkväve, NO23-N. Skillnaden ligger dock inommätosäkerheten.",2020,1]
[9,"30 Välabäcken","2020-02-25",5.9,10.8,87,7.84,20,63.5,40,86,44,13000,14,13000,12,"Värden från Synlab korr. 12/5 -20, se kommentarsflik; Resultatet av kväve total, N, är mindre än summan av ammoniumkväve, NH4-N, och nitrat + nitritkväve, NO23-N. Skillnaden ligger dock inommätosäkerheten.",2020,2]
[9,"30 Välabäcken","2020-03-24",5.4,14.6,116,8.15,5.0999999999999996,70.5,"<2",63,"<63",10000,"<10",9600,4.8,"Resultatet av kväve total, N, är mindre än summan av ammoniumkväve, NH4-N, och nitrat +nitritkväve, NO23-N. Skillnaden ligger dock inom mätosäkerheten.",2020,3]
[9,"30 Välabäcken","2020-04-21",10,14.9,132,8.31,1.8,76.400000000000006,15,37,20,8400,22,8400,"<2","Resultatet av kväve total, N, är mindre än summan av ammoniumkväve, NH4-N, och nitrat + nitritkväve, NO23-N. Skillnaden ligger dock inommätosäkerheten.",2020,4]
[9,"30 Välabäcken","2020-05-26",16.7,15.6,161,8.39,1.9,72.599999999999994,10,34,20,5200,14,5700,4.9000000000000004,"",2020,5]
[9,"30 Välabäcken","2020-06-23",15.7,11.2,113,8.08,3.6,76.400000000000006,87,120,25,6500,63,6600,2.7,"",2020,6]
[9,"30 Välabäcken","2020-07-21",14.7,11.7,116,8.14,1.8,77,50,79,15,5600,50,6100,3,"",2020,7]
[9,"30 Välabäcken","2020-08-18",15.9,9.1999999999999993,93,8,4.4000000000000004,78.8,52,95,31,5500,36,6100,7.4,"",2020,8]
[9,"30 Välabäcken","2020-09-21",15.2,10.199999999999999,102,8.1199999999999992,1.8,78.5,58,70,11,5100,22,5000,2.8,"Resultatet av kväve total, N, är mindre än summan av ammoniumkväve, NH4-N, och nitrat + nitritkväve, NO23-N. Skillnaden ligger dock inommätosäkerheten.",2020,9]
[9,"30 Välabäcken","2020-10-21",9.9,10,89,7.92,1.31,79.400000000000006,60,76,10,4900,35,5200,"<2","",2020,10]
[9,"30 Välabäcken","2020-11-26",8.4,10.7,91,8.11,2,84.2,67,86,18,13000,24,13000,2.5,"Resultatet av kväve total, N, är mindre än summan av ammoniumkväve, NH4-N, och nitrat + nitritkväve, NO23-N. Skillnaden ligger dock inommätosäkerheten.",2020,11]
[9,"30 Välabäcken","2020-12-21",6.9,10.9,90,7.97,4.5,82.5,58,99,35,13000,25,15000,6.5,"",2020,12]
[10,"16 Saxån vid Saxtorp","2020-01-27",5.4,12,95,8.19,11,62.1,50,79,38,9700,26,9700,9,"Resultatet av kväve total, N, är mindre än summan av ammoniumkväve, NH4-N, och nitrat + nitritkväve, NO23-N. Skillnaden ligger dock inommätosäkerheten.",2020,1]
[10,"16 Saxån vid Saxtorp","2020-02-25",5.2,11.1,87,8,25,51.2,45,100,48,9200,19,9500,17,"Värden från Synlab korr. 12/5 -20, se kommentarsflik",2020,2]
[10,"16 Saxån vid Saxtorp","2020-03-24",4.5999999999999996,13,101,8.1,6.8,63.8,34,57,24,8000,33,7400,6.6,"Resultatet av kväve total, N, är mindre än summan av ammoniumkväve, NH4-N, och nitrat +nitritkväve, NO23-N. Skillnaden ligger dock inom mätosäkerheten.",2020,3]
[10,"16 Saxån vid Saxtorp","2020-04-21",9.6,12.3,108,8.24,3.5,66.2,15,51,30,5300,17,5600,3.4,"",2020,4]
[10,"16 Saxån vid Saxtorp","2020-05-26",14.4,10,98,8.06,2.2000000000000002,63.3,45,68,18,3300,50,3700,2.4,"",2020,5]
[10,"16 Saxån vid Saxtorp","2020-06-23",17.7,7.2,76,7.9,2.8,69.3,130,160,10,3400,83,3600,2.4,"",2020,6]
[10,"16 Saxån vid Saxtorp","2020-07-21",16.600000000000001,7.4,76,7.9,1.7,60.3,110,130,10,2500,38,3000,"<2","",2020,7]
[10,"16 Saxån vid Saxtorp","2020-08-18",17.3,5.9,62,8,1.4,70.8,95,120,10,2800,32,3700,2.4,"",2020,8]
[10,"16 Saxån vid Saxtorp","2020-09-21",13.8,8.1999999999999993,79,7.94,2.9,65,89,110,22,2800,25,2500,6.9,"Resultatet av kväve total, N, är mindre än summan av ammoniumkväve, NH4-N, och nitrat + nitritkväve, NO23-N. Skillnaden ligger dock inommätosäkerheten.",2020,9]
[10,"16 Saxån vid Saxtorp","2020-10-21",8.1999999999999993,10.1,86,7.9,1.48,69.7,68,79,7,3800,14,4100,"<2","",2020,10]
[10,"16 Saxån vid Saxtorp","2020-11-26",8.1999999999999993,11.1,94,8.24,6.1,63.6,51,70,13,8300,18,8900,3.7,"",2020,11]
[10,"16 Saxån vid Saxtorp","2020-12-21",6.3,11.9,97,8.1199999999999992,7.2,66.5,49,74,19,9400,27,11000,6,"",2020,12]

{"sheet":"Kommentarer","index":9,"n_rows":132,"n_cols":4,"rows_kept":132,"cut":false,"hidden":false,"merged":[]}
[]
[null,"Saxån-Braån 2021"]
[null,"Vattenkontroll - Kommentarer till resultat"]
[]
[null," "]
[null,null,null,"Så här skriver du ut!"]
[null,null,null,"Klicka på aktuell månad till vänster\nObservera att sidbrytningar kan bli olika beroende på skrivare och skrivarinställningar"]
[]
[]
[]
[null,"Lund 2021-02-12"]
[null,"     Saxån-Braåns vattenvårdskommitté"]
[]
[]
[]
[]
[]
[]
[]
[]
[null,"Lund ","2021-03-11"]
[null,"     Saxån-Braåns vattenvårdskommitté"]
[]
[]
[]
[]
[]
[]
[]
[]
[null,"Lund ","2021-04-09"]
[null,"     Saxån-Braåns vattenvårdskommitté"]
[]
[]
[]
[]
[]
[]
[]
[]
[null,"Lund ","2021-05-18"]
[null,"     Saxån-Braåns vattenvårdskommitté"]
[]
[]
[]
[]
[]
[]
[]
[]
[null,"Lund ","2021-06-14"]
[null,"     Saxån-Braåns vattenvårdskommitté"]
[]
[]
[]
[]
[]
[]
[]
[]
[null,"Lund ","2021-07-26"]
[null,"     Saxån-Braåns vattenvårdskommitté"]
[]
[]
[]
[]
[]
[]
[]
[]
[null,"Lund ","2021-08-19"]
[null,"     Saxån-Braåns vattenvårdskommitté"]
[]
[]
[]
[]
[]
[]
[]
[]
[null,"Lund","2021-09-20"]
[null,"     Saxån-Braåns vattenvårdskommitté"]
[]
[]
[]
[]
[]
[]
[]
[]
[null,"Lund ","2021-10-21"]
[null,"     Saxån-Braåns vattenvårdskommitté"]
[]
[]
[]
[]
[]
[]
[]
[]
[null,"Lund ","2021-11-18"]
[null,"     Saxån-Braåns vattenvårdskommitté"]
[]
[]
[]
[]
[]
[]
[]
[]
[null,"Lund  ","2021-12-17"]
[null,"     Saxån-Braåns vattenvårdskommitté"]
[]
[]
[]
[]
[]
[]
[]
[]
[null,"Lund ","2021-01-27"]
[null,"     Saxån-Braåns vattenvårdskommitté"]
[]
[]
[]
[]
[]
[]
[]
[]
[null,"Lund ","2021-xx-xx"]
[null,"     Saxån-Braåns vattenvårdskommitté"]

{"sheet":"Kontakt","index":10,"n_rows":18,"n_cols":4,"rows_kept":18,"cut":false,"hidden":false,"merged":[[20,3,21,3],[22,3,23,3]]}
[null,"Saxån-Braån"]
[null,"Vattenkontroll - kontaktpersoner"]
[]
[null,"Konsult:",null,"Uppdragsgivare:"]
[null,"Ekologigruppen",null,"Saxån-Braåns vattenvårdskommitté"]
[null,"Stora Södergatan 8C",null,"Miljöförvaltningen"]
[null,"222 23 Lund",null,"Landskrona kommun"]
[null,null,null,"261 80 Landskrona"]
[null,"Telefon: 046-106750 (växel)",null,"Telefon: 0418-470 599"]
[null,null,null,"Telefax: 0418-470 603"]
[]
[null,"E-post:",null,"E-post:"]
[null,"nina.svenbro@ekologigruppen.se",null,"robert.andersson@landskrona.se"]
[]
[null,"Hemsida:",null,"Hemsida:"]
[null,"http://www.ekologigruppen.se/",null,"Saxån-Braåns vattenråd"]
[]
[null,"Kontaktperson: Nina Svenbro",null,"Kontaktperson: Robert Andersson"]

{"sheet":"Länkar","index":11,"n_rows":19,"n_cols":5,"rows_kept":19,"cut":false,"hidden":false,"merged":[]}
[]
[null,"Saxån-Braån"]
[null,"Vattenkontroll - länkar till äldre resultat mm"]
[null,"Länkar till nationell databas, SLU (Sveriges LantbruksUniversitet). "]
[null,"Välj data från en eller flera stationer. Välj från stationskarta eller tabell."]
[null,"Internetuppkoppling krävs för denna funktion."]
[]
[null,"Vattendrag                 SLU                 t o m 2012",null,"SLU, MVM                 fr o m 2013*","  * Välj i Undersökningar, t ex: \"SRK Saxån\" "]
[]
[]
[null,"Saxån-Braåns vattenråd"]
[null,"Saxån-Braån vattenråds databas"]
[null,"VattenAtlas"]
[null,"Vattenkartan"]
[null,"VISS, länsstyrelsernas databas för vattendata"]
[]
[null,"Länsstyrelsen i Skåne län"]
[null,"Vattenmyndigheterna"]
[null,"Naturvårdsverket"]

{"sheet":"Förklaring","index":12,"n_rows":48,"n_cols":8,"rows_kept":48,"cut":false,"hidden":false,"merged":[]}
[]
[null,"Saxån-Braån"]
[null,"Vattenkontroll - förklaring till färgmarkeringar"]
[]
[null,"Indelning av halter och värden baseras på:"]
[null,"Bedömningsgrunder för miljökvalitet - Sjöar och Vattendrag "]
[null,"Naturvårdsverket 1999 (Rapport 4913)"]
[]
[null,"Observera att bedömningsgrunderna rymmer fem klasser:"]
[]
[null,"Följande parametrar ingår i den automatiska färgmarkeringen:"]
[]
[null,"klass:",1,2,3,4,5,"Kommentar"]
[null,"pH, surhet","nära neutralt","svagt surt","måttligt","surt","mycket surt"]
[null,"pH-värde",">6,8","6,5-6,8","6,2-6,5","5,6-6,19","<5,6"]
[null,"färg, färgning","obetydligt","svagt","måttligt","betydligt ","starkt"]
[null,"mg Pt/l","<10","25-10","25-60","61-100",">100"]
[null,"grumlighet","obetydligt","svagt","måttligt","betydligt ","starkt"]
[null,"FNU/FTU","<0,5","0,5-1","1,0-2,5","2,6-7,0",">7,0"]
[null,"syrehalt, tillstånd","syrerikt","måttligt","svagt","syrefattigt","syrefritt","i sjöar bedöms bottenvatten"]
[null,"mg O2/l",">7","5-7","3-5","1-2,9","<1"]
[null,"totalfosfor, halt","låg","måttligt hög","hög","mycket hög","extremt hög","egentligen sjöar"]
[null," µg/l","<12,5","12,5-25","25-50","51-100",">100","medel maj-oktober"]
[null,"totalkväve, halt","låg","måttligt hög","hög","mycket hög","extremt hög","egentligen sjöar"]
[null," µg/l","<300","300-625","625-1250","1251-5000",">5000","medel maj-oktober"]
[]
[]
[null,"Observera att klassningssystemet egentligen är uppbyggt för att karaktärisera en provpunkt"]
[null,"där en serie av provresultat föreligger, t ex 12 prover under ett år. Oftast rekommenderas "]
[null,"att medelvärdena för mätperioden klassas men i fallet syretillstånd skall klassningen baseras"]
[null,"på minimivärdet för mätperioden."]
[]
[]
[null,"Varför färgmarkering/avmarkering?"]
[]
[null,"Färgmarkeringsfunktionen har lagts till för att uppmärksamma läsaren på anmärkningsvärt höga/"]
[null,"låga värden. Avmarkeringsfunktionen finns för att användaren enkelt skall kunna välja hur arket"]
[null,"skall studeras eller skrivas ut. "]
[]
[null,"Färgmarkeringar i resultatrapporter ingår ej i Ekologigruppens ackreditering."]
[]
[]
[null,"Referenser:"]
[null,"De referenser Ekologigruppen använder som stöd för tolkningar av kemidata och indexberäkningar är"]
[null," följande:"]
[null,"Naturvårdsverket 1999. Bedömningsgrunder för miljökvalitet - Sjöar och vattendrag. Rapport 4913."]
[null,"Havs- och vattenmyndighetens föreskrifter om klassificering och miljökvalitetsnormer avseende "]
[null,"   ytvatten, HVMFS 2019:25. Havs- och vattenmyndighetens författningssamling."]

{"sheet":"Förklaring av parametrar","index":13,"n_rows":0,"n_cols":0,"rows_kept":0,"cut":false,"hidden":false,"merged":[]}

{"sheet":"Problemhantering","index":14,"n_rows":10,"n_cols":5,"rows_kept":10,"cut":false,"hidden":true,"merged":[]}
["Problemhantering"]
[]
["OBS! Makrohanteraren är skyddad, för att få fram makron gäller lösenordet \"kontroll\""]
["Info om versionsuppdateringar, liksom makrofunktioner m m finns i en separat fil:",null,null,null,"Arsfil_Versionshistorik_och_makron.xlsx"]
[]
[]
["Om ni stöter på problem i just denna fil eller har förslag till förbättringar, skriv in nedan"]
[]
["Datum","Version","Problembeskrivning / uppdatering","Sign"]
["2021-08-19","1.6","Ny flik  \"Problemhantering\". Flikarna \"Verionshistorik\" och \"Makron m m\" flyttas till separat fil, gemensam för alla årsfiler. ","BW"]

{"sheet":"Formler","index":15,"n_rows":41,"n_cols":42,"rows_kept":41,"cut":false,"hidden":true,"merged":[]}
["Detta blad används endast av Ekologgruppens personal. Bladet är skrivskyddat."]
["Formler för alkalinitet och syremättnad"]
["Kopiera cellerna i kolumn F-H på rad 5 till de rader i bladet Resultat där syremättnad och alkalinitet ska beräknas"]
["Sorterings-","Provtagningspunkt","Provtagn"," Vattenf"," Temp"," Syreh","Syrem","  pH","Gruml","  Kond","BOD7","PO4-P","Tot-P","Part.-P"," NO3+2-N","NH4-N"," Tot-N","Susp","Anmärkning","provtagare/projektledare"]
[null,null,null,null,null,null,{"$f":"ROUND((F5/((9.266*EXP(-0.04555*E5)+5.374))*100),0)","v":0},null,null,null,null,null,null,null,null,null,null,null,null,null,null,null,null,null,null,null,null,null,null,null,null,null,null,null,null,null,null,null,null,null,null,0.02]
[]
[]
[]
[]
[]
[]
[]
[]
[]
["Sorteringsordning ALC atmis (infoga rad överst)"]
[7,5,8,2,6,4,3,1]
["Suspenderade ämnen","Ammoniumkväve, NH4-N","Fosfor total, filtrerat","Fosfor total, P","Kväve total, N","Nitrat + nitritkväve, NO23-N","Fosfor partikulärt, P","Fosfatfosfor, PO4-P"]
["Data/Sortera/Alternativ - sortera vänster till höger-OK . Sortera efter rad 1."]
["Glöm ej att kryssa tillbaka till uppifrån och ned under Alternativ."]
[]
[]
[null,"Före","efter","BOD"]
["14 Svalövsbäcken uppstr Svalöv",10.8,8.1999999999999993,{"$f":"+B23-C23","v":2.6000000000000014}]
["15:2 Svalövsbäcken nedstr Svalöv",10.9,8.1999999999999993,{"$f":"+B24-C24","v":2.7000000000000011}]
["3:2 Örstorpsbäcken",10.1,8.6,1.5]
["5 Braån vid Asmundtorp",10.6,8.8000000000000007,1.7999999999999989]
["26 Långgropen uppstr Eslöv",10.1,8.5,1.5999999999999996]
["24 Långgropen nedstr Eslöv",10,8.4,1.5999999999999996]
["30 Välabäcken",10.5,8.6999999999999993,1.8000000000000007]
["16 Saxån vid Saxtorp",10.8,9,1.8000000000000007]
[]
["14 Svalövsbäcken uppstr Svalöv",10,7.1,{"$f":"+B32-C32","v":2.9000000000000004}]
["15:2 Svalövsbäcken nedstr Svalöv",9.6999999999999993,7.1,2.5999999999999996]
["3:2 Örstorpsbäcken",9.3000000000000007,7.4,1.9000000000000004]
["5 Braån vid Asmundtorp",10,8.1,1.9000000000000004]
["28:2 Bäck N Trolleholm",9.8000000000000007,8,1.8000000000000007]
["26 Långgropen uppstr Eslöv",9.4,7.4,2]
["24 Långgropen nedstr Eslöv",9.4,7.7,1.7000000000000002]
["19 Saxån vid Annelöv",9.9,8.1,1.8000000000000007]
["30 Välabäcken",10,8.1999999999999993,1.8000000000000007]
["16 Saxån vid Saxtorp",9.9,7.7,2.2000000000000002]

{"sheet":"Provpunkter","index":16,"n_rows":10,"n_cols":7,"rows_kept":10,"cut":false,"hidden":true,"merged":[]}
[1,"14 Svalövsbäcken uppstr Svalöv",12,null,null,null,2]
[2,"15:2 Svalövsbäcken nedstr Svalöv",12]
[3,"3:2 Örstorpsbäcken",12]
[4,"5 Braån vid Asmundtorp",12]
[5,"28:2 Bäck N Trolleholm",6]
[6,"26 Långgropen uppstr Eslöv",12]
[7,"24 Långgropen nedstr Eslöv",12]
[8,"19 Saxån vid Annelöv",6]
[9,"30 Välabäcken",12]
[10,"16 Saxån vid Saxtorp",12]